null
SMILES: NS(=O)(=O)c1cccc(NC(=S)NC(=O)c2cccs2)c1
InChI Key: InChIKey=ANEATKAVCKHGKZ-UHFFFAOYSA-N
Activity Spreadsheet -- Enzyme Inhibition Constant Data from BindingDB
Found 1 hit for monomerid = 50004258
Trg + Lig
Ki
nM
ΔG°
kcal/mole
IC50
nM
Kd
nM
EC50/IC50
nM
koff
s-1
kon
M-1s-1
pHTemp
°C
Carbonic anhydrase 2
(Bos taurus)
BDBM50004258
(CHEMBL3237498)
Show SMILES NS(=O)(=O)c1cccc(NC(=S)NC(=O)c2cccs2)c1
Show InChI InChI=1S/C12H11N3O3S3/c13-21(17,18)9-4-1-3-8(7-9)14-12(19)15-11(16)10-5-2-6-20-10/h1-7H,(H2,13,17,18)(H2,14,15,16,19)
n/an/a 52n/an/an/an/an/an/a
COMSATS Institute of Information Technology
Curated by ChEMBL
Assay Description
Inhibition of bovine erythrocyte carbonic anhydrase 2 using p-nitrophenyl acetate as substrate preincubated for 10 mins before substrate addition mea...
Eur J Med Chem 78: 140-50 (2014)
Article DOI: 10.1016/j.ejmech.2014.03.023
BindingDB Entry DOI: 10.7270/Q2PN975X