BDBM50004717 CHEMBL2269025
SMILES: Cc1ccn2nc(nc2n1)S(=O)(=O)Nc1c(ccc2cccnc12)C#N
InChI Key: InChIKey=JRBGSXSTFAMCCR-UHFFFAOYSA-N
Data: 1 IC50
Activity Spreadsheet -- Enzyme Inhibition Constant Data from BindingDB
Found 1 hit for monomerid = 50004717
Trg + Lig
Ki
nM
ΔG°
kcal/mole
IC50
nM
Kd
nM
EC50/IC50
nM
koff
s-1
kon
M-1s-1
pHTemp
°C
Acetolactate synthase
(Nicotiana tabacum)
BDBM50004717
(CHEMBL2269025)
Show SMILES Cc1ccn2nc(nc2n1)S(=O)(=O)Nc1c(ccc2cccnc12)C#N
Show InChI InChI=1S/C16H11N7O2S/c1-10-6-8-23-15(19-10)20-16(21-23)26(24,25)22-14-12(9-17)5-4-11-3-2-7-18-13(11)14/h2-8,22H,1H3
n/an/a 64n/an/an/an/an/an/a
Seoul Women's University
Curated by ChEMBL
Assay Description
Inhibition of wild type Nicotiana tabacum (tobacco) GST-tagged acetolactate synthase expressed in Escherichia coli by modified Westerfeld method
Biochem Biophys Res Commun 258: 797-801 (1999)
Article DOI: 10.1006/bbrc.1999.0708
BindingDB Entry DOI: 10.7270/Q2CR5VV2