BDBM50004773 1-(4,4-Difluoro-5-hydroxymethyl-tetrahydro-furan-2-yl)-5-methyl-1H-pyrimidine-2,4-dione::CHEMBL114876
SMILES: Cc1cn([C@H]2CC(F)(F)[C@@H](CO)O2)c(=O)[nH]c1=O
InChI Key: InChIKey=JQMYGAWECCNTIR-RNFRBKRXSA-N
Data: 1 IC50
Activity Spreadsheet -- Enzyme Inhibition Constant Data from BindingDB
Found 1 hit for monomerid = 50004773
Trg + Lig
Ki
nM
ΔG°
kcal/mole
IC50
nM
Kd
nM
EC50/IC50
nM
koff
s-1
kon
M-1s-1
pHTemp
°C
Human immunodeficiency virus type 1 reverse transcriptase
(Human immunodeficiency virus 1)
BDBM50004773
(1-(4,4-Difluoro-5-hydroxymethyl-tetrahydro-furan-2...)
Show SMILES Cc1cn([C@H]2CC(F)(F)[C@@H](CO)O2)c(=O)[nH]c1=O
Show InChI InChI=1S/C10H12F2N2O4/c1-5-3-14(9(17)13-8(5)16)7-2-10(11,12)6(4-15)18-7/h3,6-7,15H,2,4H2,1H3,(H,13,16,17)/t6-,7-/m1/s1
n/an/a 8.80E+3n/an/an/an/an/an/a
Purdue University
Curated by ChEMBL
Assay Description
Concentration required to inhibit HIV reverse transcriptase
J Med Chem 35: 3369-72 (1992)
BindingDB Entry DOI: 10.7270/Q2N58N04