BDBM50004782 CHEMBL2324353
SMILES: Clc1cc(Cl)cc(c1)[C@H]1CCN(C1)[C@H]1CCN(C1=O)c1ccc(cc1)S(=O)(=O)Nc1nccs1
InChI Key: InChIKey=YGHCKDOMNUKAHH-BTYIYWSLSA-N
Data: 2 IC50
Activity Spreadsheet -- Enzyme Inhibition Constant Data from BindingDB
Found 2 hits for monomerid = 50004782
Trg + Lig
Ki
nM
ΔG°
kcal/mole
IC50
nM
Kd
nM
EC50/IC50
nM
koff
s-1
kon
M-1s-1
pHTemp
°C
Sodium channel protein type III alpha subunit
(Rattus norvegicus)
BDBM50004782
(CHEMBL2324353)
Show SMILES Clc1cc(Cl)cc(c1)[C@H]1CCN(C1)[C@H]1CCN(C1=O)c1ccc(cc1)S(=O)(=O)Nc1nccs1 |r|
Show InChI InChI=1S/C23H22Cl2N4O3S2/c24-17-11-16(12-18(25)13-17)15-5-8-28(14-15)21-6-9-29(22(21)30)19-1-3-20(4-2-19)34(31,32)27-23-26-7-10-33-23/h1-4,7,10-13,15,21H,5-6,8-9,14H2,(H,26,27)/t15-,21-/m0/s1
n/an/a<2.00E+3n/an/an/an/an/an/a
Pfizer Inc.
Curated by ChEMBL
Assay Description
Inhibition of rat voltage-gated Na channel 1.3 in dorsal root ganglion neurons by patch clamp technique
J Med Chem 56: 593-624 (2013)
Article DOI: 10.1021/jm3011433
BindingDB Entry DOI: 10.7270/Q23B61GZ
Sodium channel protein type I alpha subunit
(Rattus norvegicus)
BDBM50004782
(CHEMBL2324353)
Show SMILES Clc1cc(Cl)cc(c1)[C@H]1CCN(C1)[C@H]1CCN(C1=O)c1ccc(cc1)S(=O)(=O)Nc1nccs1 |r|
Show InChI InChI=1S/C23H22Cl2N4O3S2/c24-17-11-16(12-18(25)13-17)15-5-8-28(14-15)21-6-9-29(22(21)30)19-1-3-20(4-2-19)34(31,32)27-23-26-7-10-33-23/h1-4,7,10-13,15,21H,5-6,8-9,14H2,(H,26,27)/t15-,21-/m0/s1
n/an/a<2.00E+3n/an/an/an/an/an/a
Pfizer Inc.
Curated by ChEMBL
Assay Description
Inhibition of rat voltage-gated Na channel 1.1 in dorsal root ganglion neurons by patch clamp technique
J Med Chem 56: 593-624 (2013)
Article DOI: 10.1021/jm3011433
BindingDB Entry DOI: 10.7270/Q23B61GZ