BDBM50004859 CHEMBL2324084
SMILES: COc1ccccc1C1=NO[C@H](Cc2ccccc2)O1
InChI Key: InChIKey=ARFUCNADGLSQKO-OAHLLOKOSA-N
Data: 1 IC50
Activity Spreadsheet -- Enzyme Inhibition Constant Data from BindingDB
Found 1 hit for monomerid = 50004859
Trg + Lig
Ki
nM
ΔG°
kcal/mole
IC50
nM
Kd
nM
EC50/IC50
nM
koff
s-1
kon
M-1s-1
pHTemp
°C
Luciferin 4-monooxygenase
(Photinus pyralis)
BDBM50004859
(CHEMBL2324084)
Show SMILES COc1ccccc1C1=NO[C@H](Cc2ccccc2)O1 |r,t:9|
Show InChI InChI=1S/C16H15NO3/c1-18-14-10-6-5-9-13(14)16-17-20-15(19-16)11-12-7-3-2-4-8-12/h2-10,15H,11H2,1H3/t15-/m1/s1
n/an/a 2.10n/an/an/an/an/an/a
University of Eastern Finland
Curated by ChEMBL
Assay Description
Inhibition of recombinant firefly luciferase after 20 mins by luminescence assay
J Med Chem 56: 1064-73 (2013)
Article DOI: 10.1021/jm301516q
BindingDB Entry DOI: 10.7270/Q20G3MP0