BDBM50004861 CHEMBL2324056
SMILES: COc1ccc(cc1)C1=NO[C@H](Cc2ccccc2OC)C1
InChI Key: InChIKey=BXAXHAGYLNMKGT-MRXNPFEDSA-N
Data: 1 IC50
Activity Spreadsheet -- Enzyme Inhibition Constant Data from BindingDB
Found 1 hit for monomerid = 50004861
Trg + Lig
Ki
nM
ΔG°
kcal/mole
IC50
nM
Kd
nM
EC50/IC50
nM
koff
s-1
kon
M-1s-1
pHTemp
°C
Luciferin 4-monooxygenase
(Photinus pyralis)
BDBM50004861
(CHEMBL2324056)
Show SMILES COc1ccc(cc1)C1=NO[C@H](Cc2ccccc2OC)C1 |r,t:9|
Show InChI InChI=1S/C18H19NO3/c1-20-15-9-7-13(8-10-15)17-12-16(22-19-17)11-14-5-3-4-6-18(14)21-2/h3-10,16H,11-12H2,1-2H3/t16-/m1/s1
n/an/a 1.80n/an/an/an/an/an/a
University of Eastern Finland
Curated by ChEMBL
Assay Description
Inhibition of recombinant firefly luciferase after 20 mins by luminescence assay
J Med Chem 56: 1064-73 (2013)
Article DOI: 10.1021/jm301516q
BindingDB Entry DOI: 10.7270/Q20G3MP0