BDBM50004862 CHEMBL2324076
SMILES: C([C@@H]1CC(=NO1)c1ccccc1)c1ccccc1
InChI Key: InChIKey=IMTGFFLRCGPYTN-OAHLLOKOSA-N
Data: 1 IC50
Activity Spreadsheet -- Enzyme Inhibition Constant Data from BindingDB
Found 1 hit for monomerid = 50004862
Trg + Lig
Ki
nM
ΔG°
kcal/mole
IC50
nM
Kd
nM
EC50/IC50
nM
koff
s-1
kon
M-1s-1
pHTemp
°C
Luciferin 4-monooxygenase
(Photinus pyralis)
BDBM50004862
(CHEMBL2324076)
Show SMILES C([C@@H]1CC(=NO1)c1ccccc1)c1ccccc1 |r,c:3|
Show InChI InChI=1S/C16H15NO/c1-3-7-13(8-4-1)11-15-12-16(17-18-15)14-9-5-2-6-10-14/h1-10,15H,11-12H2/t15-/m1/s1
n/an/a 1.60n/an/an/an/an/an/a
University of Eastern Finland
Curated by ChEMBL
Assay Description
Inhibition of recombinant firefly luciferase after 20 mins by luminescence assay
J Med Chem 56: 1064-73 (2013)
Article DOI: 10.1021/jm301516q
BindingDB Entry DOI: 10.7270/Q20G3MP0