BDBM50004877 CHEMBL2324088
SMILES: COc1ccc(cc1)C1=NO[C@H](Cc2ccccc2)C1
InChI Key: InChIKey=FKBVNJUSEHGABZ-MRXNPFEDSA-N
Data: 1 IC50
Activity Spreadsheet -- Enzyme Inhibition Constant Data from BindingDB
Found 1 hit for monomerid = 50004877
Trg + Lig
Ki
nM
ΔG°
kcal/mole
IC50
nM
Kd
nM
EC50/IC50
nM
koff
s-1
kon
M-1s-1
pHTemp
°C
Luciferin 4-monooxygenase
(Photinus pyralis)
BDBM50004877
(CHEMBL2324088)
Show SMILES COc1ccc(cc1)C1=NO[C@H](Cc2ccccc2)C1 |r,t:9|
Show InChI InChI=1S/C17H17NO2/c1-19-15-9-7-14(8-10-15)17-12-16(20-18-17)11-13-5-3-2-4-6-13/h2-10,16H,11-12H2,1H3/t16-/m1/s1
n/an/a 0.290n/an/an/an/an/an/a
University of Eastern Finland
Curated by ChEMBL
Assay Description
Inhibition of recombinant firefly luciferase after 20 mins by luminescence assay
J Med Chem 56: 1064-73 (2013)
Article DOI: 10.1021/jm301516q
BindingDB Entry DOI: 10.7270/Q20G3MP0