BDBM50005144 (2-Methyl-1-{methyl-[(3,3,3-trifluoro-1-isopropyl-2-oxo-propylcarbamoyl)-methyl]-carbamoyl}-propyl)-carbamic acid benzyl ester::CHEMBL160660
SMILES: CC(C)C(NC(=O)OCc1ccccc1)C(=O)N(C)CC(=O)NC(C(C)C)C(=O)C(F)(F)F
InChI Key: InChIKey=RQXIQVUZDDRRFA-UHFFFAOYSA-N
Data: 1 IC50
Activity Spreadsheet -- Enzyme Inhibition Constant Data from BindingDB
Found 1 hit for monomerid = 50005144
Trg + Lig
Ki
nM
ΔG°
kcal/mole
IC50
nM
Kd
nM
EC50/IC50
nM
koff
s-1
kon
M-1s-1
pHTemp
°C
Leukocyte elastase
(Homo sapiens (Human))
BDBM50005144
((2-Methyl-1-{methyl-[(3,3,3-trifluoro-1-isopropyl-...)
Show SMILES CC(C)C(NC(=O)OCc1ccccc1)C(=O)N(C)CC(=O)NC(C(C)C)C(=O)C(F)(F)F
Show InChI InChI=1S/C22H30F3N3O5/c1-13(2)17(19(30)22(23,24)25)26-16(29)11-28(5)20(31)18(14(3)4)27-21(32)33-12-15-9-7-6-8-10-15/h6-10,13-14,17-18H,11-12H2,1-5H3,(H,26,29)(H,27,32)
Reactome pathway
n/an/a 153n/an/an/an/an/an/a
Boehringer Ingelheim Pharmaceuticals
Curated by ChEMBL
Assay Description
In vitro inhibitory activity against human leukocyte elastase
J Med Chem 35: 641-62 (1992)
BindingDB Entry DOI: 10.7270/Q2K074X9