null
SMILES: CCS(=O)(=O)c1ccc(OC)c(Nc2ncc(o2)-c2cc(cc(c2)-c2cccnc2)-c2cccnc2)c1
InChI Key: InChIKey=NACPZCJMBBHZEB-UHFFFAOYSA-N
Activity Spreadsheet -- Enzyme Inhibition Constant Data from BindingDB
Found 1 hit for monomerid = 50005213
Trg + Lig
Ki
nM
ΔG°
kcal/mole
IC50
nM
Kd
nM
EC50/IC50
nM
koff
s-1
kon
M-1s-1
pHTemp
°C
Vascular endothelial growth factor receptor 2
(Homo sapiens (Human))
BDBM50005213
(CHEMBL3109276)
Show SMILES CCS(=O)(=O)c1ccc(OC)c(Nc2ncc(o2)-c2cc(cc(c2)-c2cccnc2)-c2cccnc2)c1
Show InChI InChI=1S/C28H24N4O4S/c1-3-37(33,34)24-8-9-26(35-2)25(15-24)32-28-31-18-27(36-28)23-13-21(19-6-4-10-29-16-19)12-22(14-23)20-7-5-11-30-17-20/h4-18H,3H2,1-2H3,(H,31,32)
NCI pathway
Reactome pathway
n/an/a 170n/an/an/an/an/an/a
Comenius University
Curated by ChEMBL
Assay Description
Inhibition of GST-tagged recombinant human VEGFR2 expressed in Sf9 cells by radiometric assay
Eur J Med Chem 72: 146-59 (2014)
Article DOI: 10.1016/j.ejmech.2013.11.023
BindingDB Entry DOI: 10.7270/Q2K93919