BDBM50005358 CHEMBL430875
SMILES: [H][C@](O)(C[C@@]([H])(CCCc1ccccc1)C(=O)N[C@]1([H])c2ccccc2[C@@]([H])(O)[C@@]1([H])O)[C@]([H])(Cc1ccccc1)NC(=O)OC(C)(C)C
InChI Key: InChIKey=BNEUUKYSHWONFU-SZGRBJMUSA-N
Data: 1 IC50
Activity Spreadsheet -- Enzyme Inhibition Constant Data from BindingDB
Found 1 hit for monomerid = 50005358
Trg + Lig
Ki
nM
ΔG°
kcal/mole
IC50
nM
Kd
nM
EC50/IC50
nM
koff
s-1
kon
M-1s-1
pHTemp
°C
Human immunodeficiency virus type 1 protease
(Human immunodeficiency virus type 1)
BDBM50005358
(CHEMBL430875)
Show SMILES [H][C@](O)(C[C@@]([H])(CCCc1ccccc1)C(=O)N[C@]1([H])c2ccccc2[C@@]([H])(O)[C@@]1([H])O)[C@]([H])(Cc1ccccc1)NC(=O)OC(C)(C)C
Show InChI InChI=1S/C35H44N2O6/c1-35(2,3)43-34(42)36-28(21-24-15-8-5-9-16-24)29(38)22-25(18-12-17-23-13-6-4-7-14-23)33(41)37-30-26-19-10-11-20-27(26)31(39)32(30)40/h4-11,13-16,19-20,25,28-32,38-40H,12,17-18,21-22H2,1-3H3,(H,36,42)(H,37,41)/t25-,28+,29+,30-,31-,32+/m1/s1
n/an/a 0.190n/an/an/an/an/an/a
Eli Lilly and Company
Curated by ChEMBL
Assay Description
Inhibitory activity against HIV-1 protease.
J Med Chem 43: 3020-32 (2000)
BindingDB Entry DOI: 10.7270/Q2HM59P2