BDBM50005389 CHEMBL322221
SMILES: [H][C@](CC(O)[C@]([H])(Cc1ccccc1)NC(=O)OC(C)(C)C)(Cc1ccccc1)C(=O)N[C@@]1([H])CCc2ccccc12
InChI Key: InChIKey=PRRJHDLIZGFHHO-KAXSAXJRSA-N
Data: 1 IC50
Activity Spreadsheet -- Enzyme Inhibition Constant Data from BindingDB
Found 1 hit for monomerid = 50005389
Trg + Lig
Ki
nM
ΔG°
kcal/mole
IC50
nM
Kd
nM
EC50/IC50
nM
koff
s-1
kon
M-1s-1
pHTemp
°C
Human immunodeficiency virus type 1 protease
(Human immunodeficiency virus type 1)
BDBM50005389
(CHEMBL322221)
Show SMILES [H][C@](CC(O)[C@]([H])(Cc1ccccc1)NC(=O)OC(C)(C)C)(Cc1ccccc1)C(=O)N[C@@]1([H])CCc2ccccc12
Show InChI InChI=1S/C33H40N2O4/c1-33(2,3)39-32(38)35-29(21-24-14-8-5-9-15-24)30(36)22-26(20-23-12-6-4-7-13-23)31(37)34-28-19-18-25-16-10-11-17-27(25)28/h4-17,26,28-30,36H,18-22H2,1-3H3,(H,34,37)(H,35,38)/t26-,28+,29+,30?/m1/s1
n/an/a 34n/an/an/an/an/an/a
Eli Lilly and Company
Curated by ChEMBL
Assay Description
Inhibitory activity against HIV-1 protease.
J Med Chem 43: 3020-32 (2000)
BindingDB Entry DOI: 10.7270/Q2HM59P2