BDBM50005746 CHEMBL109382::CHEMBL33618::N-[9,10-Dioxo-6-(3-piperidin-1-yl-propionylamino)-9,10-dihydro-anthracen-2-yl]-3-piperidin-1-yl-propionamide
SMILES: O=C(CCN1CCCCC1)Nc1ccc2C(=O)c3cc(NC(=O)CCN4CCCCC4)ccc3C(=O)c2c1
InChI Key: InChIKey=GUSIRLMAICXUKB-UHFFFAOYSA-N
Data: 3 IC50
Activity Spreadsheet -- Enzyme Inhibition Constant Data from BindingDB
Found 3 hits for monomerid = 50005746
Trg + Lig
Ki
nM
ΔG°
kcal/mole
IC50
nM
Kd
nM
EC50/IC50
nM
koff
s-1
kon
M-1s-1
pHTemp
°C
Telomerase reverse transcriptase
(Homo sapiens (Human))
BDBM50005746
(CHEMBL109382 | CHEMBL33618 | N-[9,10-Dioxo-6-(3-pi...)
Show SMILES O=C(CCN1CCCCC1)Nc1ccc2C(=O)c3cc(NC(=O)CCN4CCCCC4)ccc3C(=O)c2c1
Show InChI InChI=1S/C30H36N4O4/c35-27(11-17-33-13-3-1-4-14-33)31-21-7-9-23-25(19-21)29(37)24-10-8-22(20-26(24)30(23)38)32-28(36)12-18-34-15-5-2-6-16-34/h7-10,19-20H,1-6,11-18H2,(H,31,35)(H,32,36)
NCI pathway
Reactome pathway
n/an/a 4.50E+3n/an/an/an/an/an/a
Institute of Cancer Research
Curated by ChEMBL
Assay Description
Inhibitory activity of telomerase was measured using the TRAP assay.
J Med Chem 41: 4873-84 (1998)
Article DOI: 10.1021/jm981067o
BindingDB Entry DOI: 10.7270/Q2WW7GSD
Telomerase reverse transcriptase
(Homo sapiens (Human))
BDBM50005746
(CHEMBL109382 | CHEMBL33618 | N-[9,10-Dioxo-6-(3-pi...)
Show SMILES O=C(CCN1CCCCC1)Nc1ccc2C(=O)c3cc(NC(=O)CCN4CCCCC4)ccc3C(=O)c2c1
Show InChI InChI=1S/C30H36N4O4/c35-27(11-17-33-13-3-1-4-14-33)31-21-7-9-23-25(19-21)29(37)24-10-8-22(20-26(24)30(23)38)32-28(36)12-18-34-15-5-2-6-16-34/h7-10,19-20H,1-6,11-18H2,(H,31,35)(H,32,36)
NCI pathway
Reactome pathway
n/an/a 4.47E+9n/an/an/an/an/an/a
TBA
Assay Description
Inhibition of telomerase in Homo sapiens (human) A549 cells after 24 hr by TRAP assay
Citation and Details
Article DOI: 10.1007/s00044-011-9594-4
BindingDB Entry DOI: 10.7270/Q2X63QV3
Telomerase reverse transcriptase
(Homo sapiens (Human))
BDBM50005746
(CHEMBL109382 | CHEMBL33618 | N-[9,10-Dioxo-6-(3-pi...)
Show SMILES O=C(CCN1CCCCC1)Nc1ccc2C(=O)c3cc(NC(=O)CCN4CCCCC4)ccc3C(=O)c2c1
Show InChI InChI=1S/C30H36N4O4/c35-27(11-17-33-13-3-1-4-14-33)31-21-7-9-23-25(19-21)29(37)24-10-8-22(20-26(24)30(23)38)32-28(36)12-18-34-15-5-2-6-16-34/h7-10,19-20H,1-6,11-18H2,(H,31,35)(H,32,36)
NCI pathway
Reactome pathway
n/an/a 4.50E+3n/an/an/an/an/an/a
Institute of Cancer Research
Curated by ChEMBL
Assay Description
Inhibition of telomerase activity
J Med Chem 41: 3253-60 (1998)
Article DOI: 10.1021/jm9801105
BindingDB Entry DOI: 10.7270/Q2TX3G1R