BDBM50005766 (+/-)-tert-Butyl-carbamic acid 1-ethyl-3a-methyl-1,2,3,3a,8,8a-hexahydro-1-aza-cyclopenta[a]inden-5-yl ester::CHEMBL34002
SMILES: CCN1CC[C@]2(C)C1Cc1ccc(OC(=O)NC(C)(C)C)cc21
InChI Key: InChIKey=CSENCZKLXRJGFD-CVMIBEPCSA-N
Data: 1 IC50
Activity Spreadsheet -- Enzyme Inhibition Constant Data from BindingDB
Found 1 hit for monomerid = 50005766
Trg + Lig
Ki
nM
ΔG°
kcal/mole
IC50
nM
Kd
nM
EC50/IC50
nM
koff
s-1
kon
M-1s-1
pHTemp
°C
Acetylcholinesterase
(Homo sapiens (Human))
BDBM50005766
((+/-)-tert-Butyl-carbamic acid 1-ethyl-3a-methyl-1...)
Show SMILES CCN1CC[C@]2(C)C1Cc1ccc(OC(=O)NC(C)(C)C)cc21
Show InChI InChI=1S/C19H28N2O2/c1-6-21-10-9-19(5)15-12-14(8-7-13(15)11-16(19)21)23-17(22)20-18(2,3)4/h7-8,12,16H,6,9-11H2,1-5H3,(H,20,22)/t16?,19-/m0/s1
NCI pathway
Reactome pathway
n/an/a 1.25E+4n/an/an/an/an/an/a
Pfizer Inc.
Curated by ChEMBL
Assay Description
In vitro inhibitory activity against human AchE (Acetylcholinesterase)
J Med Chem 35: 1429-34 (1992)
BindingDB Entry DOI: 10.7270/Q2RN38GQ