BDBM50006285 CHEMBL3234699::US8846730, 18
SMILES: CC(C)(C)c1cn(C[C@H]2CCCO2)\c(=N\C(=O)c2cc(ccc2OCc2ccccn2)C(F)(F)F)s1
InChI Key: InChIKey=NYHRWJVBTARQAN-UZZGYCMZSA-N
Data: 2 KI  2 EC50
Activity Spreadsheet -- Enzyme Inhibition Constant Data from BindingDB
Found 4 hits for monomerid = 50006285
Trg + Lig
Ki
nM
ΔG°
kcal/mole
IC50
nM
Kd
nM
EC50/IC50
nM
koff
s-1
kon
M-1s-1
pHTemp
°C
Cannabinoid receptor 2
(Rattus norvegicus (Rat))
BDBM50006285
(CHEMBL3234699 | US8846730, 18)
Show SMILES CC(C)(C)c1cn(C[C@H]2CCCO2)\c(=N\C(=O)c2cc(ccc2OCc2ccccn2)C(F)(F)F)s1 |r|
Show InChI InChI=1S/C26H28F3N3O3S/c1-25(2,3)22-15-32(14-19-8-6-12-34-19)24(36-22)31-23(33)20-13-17(26(27,28)29)9-10-21(20)35-16-18-7-4-5-11-30-18/h4-5,7,9-11,13,15,19H,6,8,12,14,16H2,1-3H3/b31-24-/t19-/m1/s1
US Patent
6 -11.4n/an/an/an/an/a7.430
AbbVie Inc.
US Patent
Assay Description
HEK293 cells stably expressing human CB2 receptors were grown until a confluent monolayer was formed. Briefly, the cells were harvested and homogeniz...
US Patent US8846730 (2014)
BindingDB Entry DOI: 10.7270/Q2028Q6Q
Cannabinoid receptor 2
(Homo sapiens (Human))
BDBM50006285
(CHEMBL3234699 | US8846730, 18)
Show SMILES CC(C)(C)c1cn(C[C@H]2CCCO2)\c(=N\C(=O)c2cc(ccc2OCc2ccccn2)C(F)(F)F)s1 |r|
Show InChI InChI=1S/C26H28F3N3O3S/c1-25(2,3)22-15-32(14-19-8-6-12-34-19)24(36-22)31-23(33)20-13-17(26(27,28)29)9-10-21(20)35-16-18-7-4-5-11-30-18/h4-5,7,9-11,13,15,19H,6,8,12,14,16H2,1-3H3/b31-24-/t19-/m1/s1
Reactome pathway
US Patent
20 -10.7n/an/an/an/an/a7.430
AbbVie Inc.
US Patent
Assay Description
HEK293 cells stably expressing human CB2 receptors were grown until a confluent monolayer was formed. Briefly, the cells were harvested and homogeniz...
US Patent US8846730 (2014)
BindingDB Entry DOI: 10.7270/Q2028Q6Q
Cannabinoid receptor 1
(Homo sapiens (Human))
BDBM50006285
(CHEMBL3234699 | US8846730, 18)
Show SMILES CC(C)(C)c1cn(C[C@H]2CCCO2)\c(=N\C(=O)c2cc(ccc2OCc2ccccn2)C(F)(F)F)s1 |r|
Show InChI InChI=1S/C26H28F3N3O3S/c1-25(2,3)22-15-32(14-19-8-6-12-34-19)24(36-22)31-23(33)20-13-17(26(27,28)29)9-10-21(20)35-16-18-7-4-5-11-30-18/h4-5,7,9-11,13,15,19H,6,8,12,14,16H2,1-3H3/b31-24-/t19-/m1/s1
NCI pathway
Reactome pathway
n/an/an/an/a>2.70E+4n/an/an/an/a
Arena Pharmaceuticals
Curated by ChEMBL
Assay Description
Displacement of [3H]-CP55940 from human CB1 receptor expressed in CHO-K1 cells by liquid scintillation counting
Cell Chem Biol 56: 8224-56 (2013)
Article DOI: 10.1021/jm4005626
BindingDB Entry DOI: 10.7270/Q2B859M5
Cannabinoid receptor 2
(Homo sapiens (Human))
BDBM50006285
(CHEMBL3234699 | US8846730, 18)
Show SMILES CC(C)(C)c1cn(C[C@H]2CCCO2)\c(=N\C(=O)c2cc(ccc2OCc2ccccn2)C(F)(F)F)s1 |r|
Show InChI InChI=1S/C26H28F3N3O3S/c1-25(2,3)22-15-32(14-19-8-6-12-34-19)24(36-22)31-23(33)20-13-17(26(27,28)29)9-10-21(20)35-16-18-7-4-5-11-30-18/h4-5,7,9-11,13,15,19H,6,8,12,14,16H2,1-3H3/b31-24-/t19-/m1/s1
Reactome pathway
n/an/an/an/a 1n/an/an/an/a
Arena Pharmaceuticals
Curated by ChEMBL
Assay Description
Displacement of [3H]-CP55940 from human CB2 receptor expressed in CHO-K1 cells by liquid scintillation counting
Cell Chem Biol 56: 8224-56 (2013)
Article DOI: 10.1021/jm4005626
BindingDB Entry DOI: 10.7270/Q2B859M5