BDBM50006811 2-(12-Hydroxy-5,10-dodecadiynyl)-3,5,6-trimethyl-p-benzoquinone::2-(12-hydroxydodeca-5,10-diyn-1-yl)-3,5,6-trimethylcyclohexa-2,5-diene-1,4-dione::2-(12-hydroxydodeca-5,10-diynyl)-3,5,6-trimethyl-1,4-benzoquinone::AA861::CHEMBL304818::cid_1967::docebenone
SMILES: Cc1c(C)c(O)c(C=CCCC#CCCCC#CCO)c(C)c1O
InChI Key: InChIKey=YJJCOKZDOWPHHH-UHFFFAOYSA-N
Data: 8 IC50
Activity Spreadsheet -- Enzyme Inhibition Constant Data from BindingDB
Found 8 hits for monomerid = 50006811
Trg + Lig
Ki
nM
ΔG°
kcal/mole
IC50
nM
Kd
nM
EC50/IC50
nM
koff
s-1
kon
M-1s-1
pHTemp
°C
YopH
(Yersinia enterocolitica)
BDBM50006811
(2-(12-Hydroxy-5,10-dodecadiynyl)-3,5,6-trimethyl-p...)
Show SMILES Cc1c(C)c(O)c(C=CCCC#CCCCC#CCO)c(C)c1O |w:8.8|
Show InChI InChI=1S/C21H26O3/c1-16-17(2)21(24)19(18(3)20(16)23)14-12-10-8-6-4-5-7-9-11-13-15-22/h12,14,22-24H,5,7-10,15H2,1-3H3
PCBioAssay
n/an/a>5.00E+4n/an/an/an/an/an/a
University of Pittsburgh Molecular Library Screening Center
Curated by PubChem BioAssay
Assay Description
Yersinia pestis is the causal agent of the bubonic plague and, although modern antibiotics are extremely effective against the malady, the plague rem...
PubChem Bioassay (2008)
BindingDB Entry DOI: 10.7270/Q2794330
YopH
(Yersinia enterocolitica)
BDBM50006811
(2-(12-Hydroxy-5,10-dodecadiynyl)-3,5,6-trimethyl-p...)
Show SMILES Cc1c(C)c(O)c(C=CCCC#CCCCC#CCO)c(C)c1O |w:8.8|
Show InChI InChI=1S/C21H26O3/c1-16-17(2)21(24)19(18(3)20(16)23)14-12-10-8-6-4-5-7-9-11-13-15-22/h12,14,22-24H,5,7-10,15H2,1-3H3
PCBioAssay
n/an/a>5.00E+4n/an/an/an/an/an/a
University of Pittsburgh Molecular Library Screening Center
Curated by PubChem BioAssay
Assay Description
Yersinia pestis is the causal agent of the bubonic plague and, although modern antibiotics are extremely effective against the malady, the plague rem...
PubChem Bioassay (2008)
BindingDB Entry DOI: 10.7270/Q2GT5KKS
YopH
(Yersinia enterocolitica)
BDBM50006811
(2-(12-Hydroxy-5,10-dodecadiynyl)-3,5,6-trimethyl-p...)
Show SMILES Cc1c(C)c(O)c(C=CCCC#CCCCC#CCO)c(C)c1O |w:8.8|
Show InChI InChI=1S/C21H26O3/c1-16-17(2)21(24)19(18(3)20(16)23)14-12-10-8-6-4-5-7-9-11-13-15-22/h12,14,22-24H,5,7-10,15H2,1-3H3
PCBioAssay
n/an/a>5.00E+4n/an/an/an/an/an/a
University of Pittsburgh Molecular Library Screening Center
Curated by PubChem BioAssay
Assay Description
Yersinia pestis is the causal agent of the bubonic plague and, although modern antibiotics are extremely effective against the malady, the plague rem...
PubChem Bioassay (2008)
BindingDB Entry DOI: 10.7270/Q2C24TVC
Arachidonate 5-lipoxygenase
(Mus musculus)
BDBM50006811
(2-(12-Hydroxy-5,10-dodecadiynyl)-3,5,6-trimethyl-p...)
Show SMILES Cc1c(C)c(O)c(C=CCCC#CCCCC#CCO)c(C)c1O |w:8.8|
Show InChI InChI=1S/C21H26O3/c1-16-17(2)21(24)19(18(3)20(16)23)14-12-10-8-6-4-5-7-9-11-13-15-22/h12,14,22-24H,5,7-10,15H2,1-3H3
n/an/a 32n/an/an/an/an/an/a
Yeungnam University
Curated by ChEMBL
Assay Description
Inhibitory activity against murine lipoxygenase-2.
Bioorg Med Chem Lett 14: 2559-62 (2004)
Article DOI: 10.1016/j.bmcl.2004.02.099
BindingDB Entry DOI: 10.7270/Q2VD7005
Arachidonate 5-lipoxygenase
(Rattus norvegicus)
BDBM50006811
(2-(12-Hydroxy-5,10-dodecadiynyl)-3,5,6-trimethyl-p...)
Show SMILES Cc1c(C)c(O)c(C=CCCC#CCCCC#CCO)c(C)c1O |w:8.8|
Show InChI InChI=1S/C21H26O3/c1-16-17(2)21(24)19(18(3)20(16)23)14-12-10-8-6-4-5-7-9-11-13-15-22/h12,14,22-24H,5,7-10,15H2,1-3H3
n/an/a 90n/an/an/an/an/an/a
Takeda Chemical Industries, Ltd.
Curated by ChEMBL
Assay Description
The concentration required to reduce by 50% the amount of LTB4 formed by RBL-1 cells
J Med Chem 34: 267-76 (1991)
BindingDB Entry DOI: 10.7270/Q2SN07X9
Arachidonate 5-lipoxygenase
(Homo sapiens (Human))
BDBM50006811
(2-(12-Hydroxy-5,10-dodecadiynyl)-3,5,6-trimethyl-p...)
Show SMILES Cc1c(C)c(O)c(C=CCCC#CCCCC#CCO)c(C)c1O |w:8.8|
Show InChI InChI=1S/C21H26O3/c1-16-17(2)21(24)19(18(3)20(16)23)14-12-10-8-6-4-5-7-9-11-13-15-22/h12,14,22-24H,5,7-10,15H2,1-3H3
Reactome pathway
n/an/a 1.70E+3n/an/an/an/an/an/a
University of Hyderabad
Curated by ChEMBL
Assay Description
Inhibition of 5-LOX assessed as decrease in oxygen concentration using arachidonic acid as substrate by polarigraphic method with Clark's oxygen elec...
Eur J Med Chem 47: 351-9 (2012)
Article DOI: 10.1016/j.ejmech.2011.11.003
BindingDB Entry DOI: 10.7270/Q2TT4RCW
Arachidonate 5-lipoxygenase
(Rattus norvegicus)
BDBM50006811
(2-(12-Hydroxy-5,10-dodecadiynyl)-3,5,6-trimethyl-p...)
Show SMILES Cc1c(C)c(O)c(C=CCCC#CCCCC#CCO)c(C)c1O |w:8.8|
Show InChI InChI=1S/C21H26O3/c1-16-17(2)21(24)19(18(3)20(16)23)14-12-10-8-6-4-5-7-9-11-13-15-22/h12,14,22-24H,5,7-10,15H2,1-3H3
n/an/a 2.00E+3n/an/an/an/an/an/a
Beecham Pharmaceuticals--Research Division
Curated by ChEMBL
Assay Description
In vitro inhibition of RBL-1 5-lipoxygenase
J Med Chem 30: 2216-21 (1988)
BindingDB Entry DOI: 10.7270/Q27M08JG
leucine aminopeptidase
(Plasmodium falciparum 3D7)
BDBM50006811
(2-(12-Hydroxy-5,10-dodecadiynyl)-3,5,6-trimethyl-p...)
Show SMILES Cc1c(C)c(O)c(C=CCCC#CCCCC#CCO)c(C)c1O |w:8.8|
Show InChI InChI=1S/C21H26O3/c1-16-17(2)21(24)19(18(3)20(16)23)14-12-10-8-6-4-5-7-9-11-13-15-22/h12,14,22-24H,5,7-10,15H2,1-3H3
PCBioAssay
n/an/a 5.35E+4n/an/an/an/an/an/a
SRMLSC
Curated by PubChem BioAssay
Assay Description
Southern Research Molecular Libraries Screening Center (SRMLSC) Southern Research Institute (Birmingham, Alabama) NIH Molecular Libraries Screening...
PubChem Bioassay (2009)
BindingDB Entry DOI: 10.7270/Q27W69N8