BDBM50006899 CHEMBL3237239
SMILES: Cc1c(Cc2ccc(=O)n(Cc3ccccc3F)n2)c2cc(F)ccc2n1CC(O)=O
InChI Key: InChIKey=WWJPBZDHDXCGQJ-UHFFFAOYSA-N
Data: 1 IC50
Activity Spreadsheet -- Enzyme Inhibition Constant Data from BindingDB
Found 1 hit for monomerid = 50006899
Trg + Lig
Ki
nM
ΔG°
kcal/mole
IC50
nM
Kd
nM
EC50/IC50
nM
koff
s-1
kon
M-1s-1
pHTemp
°C
G protein-coupled receptor 44
(Homo sapiens (Human))
BDBM50006899
(CHEMBL3237239)
Show SMILES Cc1c(Cc2ccc(=O)n(Cc3ccccc3F)n2)c2cc(F)ccc2n1CC(O)=O
Show InChI InChI=1S/C23H19F2N3O3/c1-14-18(19-10-16(24)6-8-21(19)27(14)13-23(30)31)11-17-7-9-22(29)28(26-17)12-15-4-2-3-5-20(15)25/h2-10H,11-13H2,1H3,(H,30,31)
Reactome pathway
n/an/a 3n/an/an/an/an/an/a
Pfizer Inc.
Curated by ChEMBL
Assay Description
Antagonist activity at human recombinant CRTh2 expressed in CHO-K1 cells by cAMP TR FRET assay
J Med Chem 57: 1299-322 (2014)
Article DOI: 10.1021/jm401509e
BindingDB Entry DOI: 10.7270/Q21V5GGH