null
SMILES: COc1ccc(Nc2cc(N[C@@H]3CCCC[C@@H]3N)nnc2C(N)=O)nc1OC
InChI Key: InChIKey=STNAXKXNXRFLMU-WDEREUQCSA-N
Activity Spreadsheet -- Enzyme Inhibition Constant Data from BindingDB
Found 4 hits for monomerid = 50007094
Trg + Lig
Ki
nM
ΔG°
kcal/mole
IC50
nM
Kd
nM
EC50/IC50
nM
koff
s-1
kon
M-1s-1
pHTemp
°C
Tyrosine-protein kinase SYK
(Homo sapiens (Human))
BDBM50007094
(CHEMBL3237565)
Show SMILES COc1ccc(Nc2cc(N[C@@H]3CCCC[C@@H]3N)nnc2C(N)=O)nc1OC |r|
Show InChI InChI=1S/C18H25N7O3/c1-27-13-7-8-14(23-18(13)28-2)22-12-9-15(24-25-16(12)17(20)26)21-11-6-4-3-5-10(11)19/h7-11H,3-6,19H2,1-2H3,(H2,20,26)(H2,21,22,23,24)/t10-,11+/m0/s1
NCI pathway
Reactome pathway
n/an/a 4n/an/an/an/an/an/a
Hoffmann-La Roche Inc.
Curated by ChEMBL
Assay Description
Inhibition of human SYK (360 to 635) using biotin-EPEGDYEEVLE as substrate preincubated for 10 mins followed by substrate/ATP/[33Pgamma]ATP addition ...
J Med Chem 57: 2683-91 (2014)
Article DOI: 10.1021/jm401982j
BindingDB Entry DOI: 10.7270/Q2HT2QTR
Potassium voltage-gated channel subfamily H member 2
(Homo sapiens (Human))
BDBM50007094
(CHEMBL3237565)
Show SMILES COc1ccc(Nc2cc(N[C@@H]3CCCC[C@@H]3N)nnc2C(N)=O)nc1OC |r|
Show InChI InChI=1S/C18H25N7O3/c1-27-13-7-8-14(23-18(13)28-2)22-12-9-15(24-25-16(12)17(20)26)21-11-6-4-3-5-10(11)19/h7-11H,3-6,19H2,1-2H3,(H2,20,26)(H2,21,22,23,24)/t10-,11+/m0/s1
Reactome pathway
n/an/a 5.01E+3n/an/an/an/an/an/a
Hoffmann-La Roche Inc.
Curated by ChEMBL
Assay Description
Inhibition of human ERG expressed in CHO cells by patch clamp method
J Med Chem 57: 2683-91 (2014)
Article DOI: 10.1021/jm401982j
BindingDB Entry DOI: 10.7270/Q2HT2QTR
Cytochrome P450 2D6
(Homo sapiens (Human))
BDBM50007094
(CHEMBL3237565)
Show SMILES COc1ccc(Nc2cc(N[C@@H]3CCCC[C@@H]3N)nnc2C(N)=O)nc1OC |r|
Show InChI InChI=1S/C18H25N7O3/c1-27-13-7-8-14(23-18(13)28-2)22-12-9-15(24-25-16(12)17(20)26)21-11-6-4-3-5-10(11)19/h7-11H,3-6,19H2,1-2H3,(H2,20,26)(H2,21,22,23,24)/t10-,11+/m0/s1
n/an/a 3.30E+4n/an/an/an/an/an/a
Hoffmann-La Roche Inc.
Curated by ChEMBL
Assay Description
Inhibition of CYP2D6 in human liver microsomal fraction assessed as dextromethorphan O-demethylase preincubated for 10 mins followed by NADPH additio...
J Med Chem 57: 2683-91 (2014)
Article DOI: 10.1021/jm401982j
BindingDB Entry DOI: 10.7270/Q2HT2QTR
Tyrosine-protein kinase SYK
(Homo sapiens (Human))
BDBM50007094
(CHEMBL3237565)
Show SMILES COc1ccc(Nc2cc(N[C@@H]3CCCC[C@@H]3N)nnc2C(N)=O)nc1OC |r|
Show InChI InChI=1S/C18H25N7O3/c1-27-13-7-8-14(23-18(13)28-2)22-12-9-15(24-25-16(12)17(20)26)21-11-6-4-3-5-10(11)19/h7-11H,3-6,19H2,1-2H3,(H2,20,26)(H2,21,22,23,24)/t10-,11+/m0/s1
NCI pathway
Reactome pathway
n/an/a 32n/an/an/an/an/an/a
Hoffmann-La Roche Inc.
Curated by ChEMBL
Assay Description
Inhibition of SYK in human whole blood assessed as anti-human IgM-induced CD69 protein expression preincubated for 30 mins followed by anti-human IgM...
J Med Chem 57: 2683-91 (2014)
Article DOI: 10.1021/jm401982j
BindingDB Entry DOI: 10.7270/Q2HT2QTR