BDBM50007105 CHEMBL3237573
SMILES: CC(C)c1nc(Nc2cc(N[C@@H]3CCCC[C@@H]3N)nnc2C(N)=O)ccc1C
InChI Key: InChIKey=FOVSNASTDPXXSC-UONOGXRCSA-N
Data: 3 IC50
Activity Spreadsheet -- Enzyme Inhibition Constant Data from BindingDB
Found 3 hits for monomerid = 50007105
Trg + Lig
Ki
nM
ΔG°
kcal/mole
IC50
nM
Kd
nM
EC50/IC50
nM
koff
s-1
kon
M-1s-1
pHTemp
°C
Tyrosine-protein kinase SYK
(Homo sapiens (Human))
BDBM50007105
(CHEMBL3237573)
Show SMILES CC(C)c1nc(Nc2cc(N[C@@H]3CCCC[C@@H]3N)nnc2C(N)=O)ccc1C |r|
Show InChI InChI=1S/C20H29N7O/c1-11(2)18-12(3)8-9-16(25-18)24-15-10-17(26-27-19(15)20(22)28)23-14-7-5-4-6-13(14)21/h8-11,13-14H,4-7,21H2,1-3H3,(H2,22,28)(H2,23,24,25,26)/t13-,14+/m0/s1
NCI pathway
Reactome pathway
n/an/a 3.20n/an/an/an/an/an/a
Hoffmann-La Roche Inc.
Curated by ChEMBL
Assay Description
Inhibition of human SYK (360 to 635) using biotin-EPEGDYEEVLE as substrate preincubated for 10 mins followed by substrate/ATP/[33Pgamma]ATP addition ...
J Med Chem 57: 2683-91 (2014)
Article DOI: 10.1021/jm401982j
BindingDB Entry DOI: 10.7270/Q2HT2QTR
Potassium voltage-gated channel subfamily H member 2
(Homo sapiens (Human))
BDBM50007105
(CHEMBL3237573)
Show SMILES CC(C)c1nc(Nc2cc(N[C@@H]3CCCC[C@@H]3N)nnc2C(N)=O)ccc1C |r|
Show InChI InChI=1S/C20H29N7O/c1-11(2)18-12(3)8-9-16(25-18)24-15-10-17(26-27-19(15)20(22)28)23-14-7-5-4-6-13(14)21/h8-11,13-14H,4-7,21H2,1-3H3,(H2,22,28)(H2,23,24,25,26)/t13-,14+/m0/s1
Reactome pathway
n/an/a 1.00E+3n/an/an/an/an/an/a
Hoffmann-La Roche Inc.
Curated by ChEMBL
Assay Description
Inhibition of human ERG expressed in CHO cells by patch clamp method
J Med Chem 57: 2683-91 (2014)
Article DOI: 10.1021/jm401982j
BindingDB Entry DOI: 10.7270/Q2HT2QTR
Tyrosine-protein kinase SYK
(Homo sapiens (Human))
BDBM50007105
(CHEMBL3237573)
Show SMILES CC(C)c1nc(Nc2cc(N[C@@H]3CCCC[C@@H]3N)nnc2C(N)=O)ccc1C |r|
Show InChI InChI=1S/C20H29N7O/c1-11(2)18-12(3)8-9-16(25-18)24-15-10-17(26-27-19(15)20(22)28)23-14-7-5-4-6-13(14)21/h8-11,13-14H,4-7,21H2,1-3H3,(H2,22,28)(H2,23,24,25,26)/t13-,14+/m0/s1
NCI pathway
Reactome pathway
n/an/a 794n/an/an/an/an/an/a
Hoffmann-La Roche Inc.
Curated by ChEMBL
Assay Description
Inhibition of SYK in human whole blood assessed as anti-human IgM-induced CD69 protein expression preincubated for 30 mins followed by anti-human IgM...
J Med Chem 57: 2683-91 (2014)
Article DOI: 10.1021/jm401982j
BindingDB Entry DOI: 10.7270/Q2HT2QTR