null
SMILES: CC(C)(C)CC[C@@H](N1C(=O)C(=N[C@@]11CC[C@@H](CC1)C(C)(C)C)c1cccc(Cl)c1)c1ccc(cc1)C(=O)NCc1nn[nH]n1
InChI Key: InChIKey=JNOOMJGFUMIRDK-YYZPWFNASA-N
Activity Spreadsheet -- Enzyme Inhibition Constant Data from BindingDB
Found 4 hits for monomerid = 50007226
Trg + Lig
Ki
nM
ΔG°
kcal/mole
IC50
nM
Kd
nM
EC50/IC50
nM
koff
s-1
kon
M-1s-1
pHTemp
°C
Glucagon receptor
(Homo sapiens (Human))
BDBM50007226
(CHEMBL3238218)
Show SMILES CC(C)(C)CC[C@@H](N1C(=O)C(=N[C@@]11CC[C@@H](CC1)C(C)(C)C)c1cccc(Cl)c1)c1ccc(cc1)C(=O)NCc1nn[nH]n1 |r,wU:15.19,6.5,wD:12.13,c:10,(54.79,-14.62,;54.77,-13.08,;53.43,-12.33,;53.44,-13.84,;56.1,-12.29,;56.08,-10.75,;57.4,-9.97,;57.35,-8.43,;58.56,-7.48,;60.04,-7.9,;58.03,-6.03,;56.49,-6.09,;56.07,-7.57,;54.88,-6.59,;53.44,-7.12,;53.17,-8.64,;54.36,-9.62,;55.81,-9.09,;51.74,-9.17,;50.55,-8.18,;50.29,-9.7,;51.47,-10.69,;58.81,-4.7,;60.35,-4.72,;61.12,-3.39,;60.36,-2.04,;58.82,-2.04,;58.05,-.7,;58.04,-3.37,;58.73,-10.75,;58.71,-12.3,;60.03,-13.08,;61.38,-12.33,;61.4,-10.79,;60.07,-10.01,;62.7,-13.12,;62.68,-14.66,;64.04,-12.37,;65.37,-13.15,;66.71,-12.4,;68.11,-13.04,;69.15,-11.9,;68.39,-10.56,;66.88,-10.87,)|
Show InChI InChI=1S/C34H44ClN7O2/c1-32(2,3)17-16-27(22-10-12-23(13-11-22)30(43)36-21-28-38-40-41-39-28)42-31(44)29(24-8-7-9-26(35)20-24)37-34(42)18-14-25(15-19-34)33(4,5)6/h7-13,20,25,27H,14-19,21H2,1-6H3,(H,36,43)(H,38,39,40,41)/t25-,27-,34-/m1/s1
n/an/a 14n/an/an/an/an/an/a
Merck Research Laboratories
Curated by ChEMBL
Assay Description
Displacement of [125I]-glucagon from recombinant human GCGR expressed in CHO cells after 60 mins by scintillation counting analysis
J Med Chem 57: 2601-10 (2014)
Article DOI: 10.1021/jm401858f
BindingDB Entry DOI: 10.7270/Q20V8F9P
Glucagon-like peptide 1 receptor
(Homo sapiens (Human))
BDBM50007226
(CHEMBL3238218)
Show SMILES CC(C)(C)CC[C@@H](N1C(=O)C(=N[C@@]11CC[C@@H](CC1)C(C)(C)C)c1cccc(Cl)c1)c1ccc(cc1)C(=O)NCc1nn[nH]n1 |r,wU:15.19,6.5,wD:12.13,c:10,(54.79,-14.62,;54.77,-13.08,;53.43,-12.33,;53.44,-13.84,;56.1,-12.29,;56.08,-10.75,;57.4,-9.97,;57.35,-8.43,;58.56,-7.48,;60.04,-7.9,;58.03,-6.03,;56.49,-6.09,;56.07,-7.57,;54.88,-6.59,;53.44,-7.12,;53.17,-8.64,;54.36,-9.62,;55.81,-9.09,;51.74,-9.17,;50.55,-8.18,;50.29,-9.7,;51.47,-10.69,;58.81,-4.7,;60.35,-4.72,;61.12,-3.39,;60.36,-2.04,;58.82,-2.04,;58.05,-.7,;58.04,-3.37,;58.73,-10.75,;58.71,-12.3,;60.03,-13.08,;61.38,-12.33,;61.4,-10.79,;60.07,-10.01,;62.7,-13.12,;62.68,-14.66,;64.04,-12.37,;65.37,-13.15,;66.71,-12.4,;68.11,-13.04,;69.15,-11.9,;68.39,-10.56,;66.88,-10.87,)|
Show InChI InChI=1S/C34H44ClN7O2/c1-32(2,3)17-16-27(22-10-12-23(13-11-22)30(43)36-21-28-38-40-41-39-28)42-31(44)29(24-8-7-9-26(35)20-24)37-34(42)18-14-25(15-19-34)33(4,5)6/h7-13,20,25,27H,14-19,21H2,1-6H3,(H,36,43)(H,38,39,40,41)/t25-,27-,34-/m1/s1
n/an/a>1.00E+4n/an/an/an/an/an/a
Merck Research Laboratories
Curated by ChEMBL
Assay Description
Antagonist activity at human GLP-1R expressed in CHO cells assessed as inhibition of GLP-1-stimulated cAMP production preincubated for 30 mins follow...
J Med Chem 57: 2601-10 (2014)
Article DOI: 10.1021/jm401858f
BindingDB Entry DOI: 10.7270/Q20V8F9P
Glucagon receptor
(Homo sapiens (Human))
BDBM50007226
(CHEMBL3238218)
Show SMILES CC(C)(C)CC[C@@H](N1C(=O)C(=N[C@@]11CC[C@@H](CC1)C(C)(C)C)c1cccc(Cl)c1)c1ccc(cc1)C(=O)NCc1nn[nH]n1 |r,wU:15.19,6.5,wD:12.13,c:10,(54.79,-14.62,;54.77,-13.08,;53.43,-12.33,;53.44,-13.84,;56.1,-12.29,;56.08,-10.75,;57.4,-9.97,;57.35,-8.43,;58.56,-7.48,;60.04,-7.9,;58.03,-6.03,;56.49,-6.09,;56.07,-7.57,;54.88,-6.59,;53.44,-7.12,;53.17,-8.64,;54.36,-9.62,;55.81,-9.09,;51.74,-9.17,;50.55,-8.18,;50.29,-9.7,;51.47,-10.69,;58.81,-4.7,;60.35,-4.72,;61.12,-3.39,;60.36,-2.04,;58.82,-2.04,;58.05,-.7,;58.04,-3.37,;58.73,-10.75,;58.71,-12.3,;60.03,-13.08,;61.38,-12.33,;61.4,-10.79,;60.07,-10.01,;62.7,-13.12,;62.68,-14.66,;64.04,-12.37,;65.37,-13.15,;66.71,-12.4,;68.11,-13.04,;69.15,-11.9,;68.39,-10.56,;66.88,-10.87,)|
Show InChI InChI=1S/C34H44ClN7O2/c1-32(2,3)17-16-27(22-10-12-23(13-11-22)30(43)36-21-28-38-40-41-39-28)42-31(44)29(24-8-7-9-26(35)20-24)37-34(42)18-14-25(15-19-34)33(4,5)6/h7-13,20,25,27H,14-19,21H2,1-6H3,(H,36,43)(H,38,39,40,41)/t25-,27-,34-/m1/s1
n/an/a 130n/an/an/an/an/an/a
Merck Research Laboratories
Curated by ChEMBL
Assay Description
Antagonist activity at human GCGR expressed in CHO cells assessed as inhibition of glucagon-stimulated cAMP production preincubated for 30 mins follo...
J Med Chem 57: 2601-10 (2014)
Article DOI: 10.1021/jm401858f
BindingDB Entry DOI: 10.7270/Q20V8F9P
Glucagon receptor
(Mus musculus)
BDBM50007226
(CHEMBL3238218)
Show SMILES CC(C)(C)CC[C@@H](N1C(=O)C(=N[C@@]11CC[C@@H](CC1)C(C)(C)C)c1cccc(Cl)c1)c1ccc(cc1)C(=O)NCc1nn[nH]n1 |r,wU:15.19,6.5,wD:12.13,c:10,(54.79,-14.62,;54.77,-13.08,;53.43,-12.33,;53.44,-13.84,;56.1,-12.29,;56.08,-10.75,;57.4,-9.97,;57.35,-8.43,;58.56,-7.48,;60.04,-7.9,;58.03,-6.03,;56.49,-6.09,;56.07,-7.57,;54.88,-6.59,;53.44,-7.12,;53.17,-8.64,;54.36,-9.62,;55.81,-9.09,;51.74,-9.17,;50.55,-8.18,;50.29,-9.7,;51.47,-10.69,;58.81,-4.7,;60.35,-4.72,;61.12,-3.39,;60.36,-2.04,;58.82,-2.04,;58.05,-.7,;58.04,-3.37,;58.73,-10.75,;58.71,-12.3,;60.03,-13.08,;61.38,-12.33,;61.4,-10.79,;60.07,-10.01,;62.7,-13.12,;62.68,-14.66,;64.04,-12.37,;65.37,-13.15,;66.71,-12.4,;68.11,-13.04,;69.15,-11.9,;68.39,-10.56,;66.88,-10.87,)|
Show InChI InChI=1S/C34H44ClN7O2/c1-32(2,3)17-16-27(22-10-12-23(13-11-22)30(43)36-21-28-38-40-41-39-28)42-31(44)29(24-8-7-9-26(35)20-24)37-34(42)18-14-25(15-19-34)33(4,5)6/h7-13,20,25,27H,14-19,21H2,1-6H3,(H,36,43)(H,38,39,40,41)/t25-,27-,34-/m1/s1
n/an/a 130n/an/an/an/an/an/a
Merck Research Laboratories
Curated by ChEMBL
Assay Description
Displacement of [125I]-glucagon from GCGR in mouse liver membranes after 60 mins by scintillation counting analysis
J Med Chem 57: 2601-10 (2014)
Article DOI: 10.1021/jm401858f
BindingDB Entry DOI: 10.7270/Q20V8F9P