BDBM50007535 8-(2-Azetidin-1-yl-ethyl)-3-chloro-6-methyl-7,8-dihydro-6H-9-oxa-1,6-diaza-benzocycloheptene-5-thione::CHEMBL25198
SMILES: CN1C[C@H](CCN2CCC2)Oc2ncc(Cl)cc2C1=S
InChI Key: InChIKey=TTZNDWMUJXPGIQ-NSHDSACASA-N
Data: 1 IC50
Activity Spreadsheet -- Enzyme Inhibition Constant Data from BindingDB
Found 1 hit for monomerid = 50007535
Trg + Lig
Ki
nM
ΔG°
kcal/mole
IC50
nM
Kd
nM
EC50/IC50
nM
koff
s-1
kon
M-1s-1
pHTemp
°C
Histamine H1 receptor
(Cavia porcellus (domestic guinea pig))
BDBM50007535
(8-(2-Azetidin-1-yl-ethyl)-3-chloro-6-methyl-7,8-di...)
Show SMILES CN1C[C@H](CCN2CCC2)Oc2ncc(Cl)cc2C1=S
Show InChI InChI=1S/C14H18ClN3OS/c1-17-9-11(3-6-18-4-2-5-18)19-13-12(14(17)20)7-10(15)8-16-13/h7-8,11H,2-6,9H2,1H3/t11-/m0/s1
n/an/a 870n/an/an/an/an/an/a
A. H. Robins Company, Inc.
Curated by ChEMBL
Assay Description
Inhibition of [3H]-mepyramine binding to the Histamine H1 receptor in guinea pig cortex
J Med Chem 34: 1314-28 (1991)
BindingDB Entry DOI: 10.7270/Q23F4NMG