null
SMILES: C[C@](O)(COc1ccccc1Cl)C(=O)N1CCc2c1cccc2C#N
InChI Key: InChIKey=HBOKTUYVRUPMDS-IBGZPJMESA-N
Activity Spreadsheet -- Enzyme Inhibition Constant Data from BindingDB
Found 3 hits for monomerid = 50007605
Trg + Lig
Ki
nM
ΔG°
kcal/mole
IC50
nM
Kd
nM
EC50/IC50
nM
koff
s-1
kon
M-1s-1
pHTemp
°C
Androgen receptor
(Homo sapiens (Human))
BDBM50007605
(CHEMBL3238279)
Show SMILES C[C@](O)(COc1ccccc1Cl)C(=O)N1CCc2c1cccc2C#N |r|
Show InChI InChI=1S/C19H17ClN2O3/c1-19(24,12-25-17-8-3-2-6-15(17)20)18(23)22-10-9-14-13(11-21)5-4-7-16(14)22/h2-8,24H,9-10,12H2,1H3/t19-/m0/s1
NCI pathway
Reactome pathway
n/an/an/an/a 4.82E+3n/an/an/an/a
Pfizer Inc.
Curated by ChEMBL
Assay Description
Binding affinity to human AR NTD (1 to 561 aa) expressed in CV1 cells coexpressing human AR-LBD (644-919 aa) assessed as N/C-termini interaction by a...
J Med Chem 57: 2462-71 (2014)
Article DOI: 10.1021/jm401625b
BindingDB Entry DOI: 10.7270/Q2RB763C
Androgen receptor
(Homo sapiens (Human))
BDBM50007605
(CHEMBL3238279)
Show SMILES C[C@](O)(COc1ccccc1Cl)C(=O)N1CCc2c1cccc2C#N |r|
Show InChI InChI=1S/C19H17ClN2O3/c1-19(24,12-25-17-8-3-2-6-15(17)20)18(23)22-10-9-14-13(11-21)5-4-7-16(14)22/h2-8,24H,9-10,12H2,1H3/t19-/m0/s1
NCI pathway
Reactome pathway
n/an/a 56n/an/an/an/an/an/a
Pfizer Inc.
Curated by ChEMBL
Assay Description
Displacement of [3H]mibolerone from full length human AR expressed in COS cells after 3.5 hrs by liquid scintillation counting
J Med Chem 57: 2462-71 (2014)
Article DOI: 10.1021/jm401625b
BindingDB Entry DOI: 10.7270/Q2RB763C
Androgen receptor
(Homo sapiens (Human))
BDBM50007605
(CHEMBL3238279)
Show SMILES C[C@](O)(COc1ccccc1Cl)C(=O)N1CCc2c1cccc2C#N |r|
Show InChI InChI=1S/C19H17ClN2O3/c1-19(24,12-25-17-8-3-2-6-15(17)20)18(23)22-10-9-14-13(11-21)5-4-7-16(14)22/h2-8,24H,9-10,12H2,1H3/t19-/m0/s1
NCI pathway
Reactome pathway
n/an/an/an/a 6.10n/an/an/an/a
Pfizer Inc.
Curated by ChEMBL
Assay Description
Agonist activity at human AR expressed in CV1 cells after 17 hrs by luciferase reporter gene assay
J Med Chem 57: 2462-71 (2014)
Article DOI: 10.1021/jm401625b
BindingDB Entry DOI: 10.7270/Q2RB763C