BDBM50007748 CHEMBL3233758
SMILES: Fc1ccc(Nc2ncnc3sc(NC(=O)C4CCCC4)cc23)cc1Cl
InChI Key: InChIKey=XABKAQXYZIBSDI-UHFFFAOYSA-N
Data: 1 IC50
Activity Spreadsheet -- Enzyme Inhibition Constant Data from BindingDB
Found 1 hit for monomerid = 50007748
Trg + Lig
Ki
nM
ΔG°
kcal/mole
IC50
nM
Kd
nM
EC50/IC50
nM
koff
s-1
kon
M-1s-1
pHTemp
°C
Epidermal growth factor receptor
(Homo sapiens (Human))
BDBM50007748
(CHEMBL3233758)
Show SMILES Fc1ccc(Nc2ncnc3sc(NC(=O)C4CCCC4)cc23)cc1Cl
Show InChI InChI=1S/C18H16ClFN4OS/c19-13-7-11(5-6-14(13)20)23-16-12-8-15(26-18(12)22-9-21-16)24-17(25)10-3-1-2-4-10/h5-10H,1-4H2,(H,24,25)(H,21,22,23)
n/an/a>1.00E+4n/an/an/an/an/an/a
Chinese Academy of Sciences
Curated by ChEMBL
Assay Description
Inhibition of wild type EGFR domain (unknown origin) expressed in baculovirus expression system using Poly(Glu:Tyr)4:1 substrate after 60 mins by ELI...
Bioorg Med Chem 22: 2366-78 (2014)
Article DOI: 10.1016/j.bmc.2014.01.035
BindingDB Entry DOI: 10.7270/Q2QC051F