BDBM50007765 CHEMBL3233775
SMILES: Fc1ccc(Nc2ncnc3sc(NC(=O)\C=C\CNC4CCOCC4)cc23)cc1Cl
InChI Key: InChIKey=OIZNALHIZLRBSA-OWOJBTEDSA-N
Data: 1 IC50
Activity Spreadsheet -- Enzyme Inhibition Constant Data from BindingDB
Found 1 hit for monomerid = 50007765
Trg + Lig
Ki
nM
ΔG°
kcal/mole
IC50
nM
Kd
nM
EC50/IC50
nM
koff
s-1
kon
M-1s-1
pHTemp
°C
Epidermal growth factor receptor
(Homo sapiens (Human))
BDBM50007765
(CHEMBL3233775)
Show SMILES Fc1ccc(Nc2ncnc3sc(NC(=O)\C=C\CNC4CCOCC4)cc23)cc1Cl
Show InChI InChI=1S/C21H21ClFN5O2S/c22-16-10-14(3-4-17(16)23)27-20-15-11-19(31-21(15)26-12-25-20)28-18(29)2-1-7-24-13-5-8-30-9-6-13/h1-4,10-13,24H,5-9H2,(H,28,29)(H,25,26,27)/b2-1+
n/an/a 20n/an/an/an/an/an/a
Chinese Academy of Sciences
Curated by ChEMBL
Assay Description
Inhibition of wild type EGFR domain (unknown origin) expressed in baculovirus expression system using Poly(Glu:Tyr)4:1 substrate after 60 mins by ELI...
Bioorg Med Chem 22: 2366-78 (2014)
Article DOI: 10.1016/j.bmc.2014.01.035
BindingDB Entry DOI: 10.7270/Q2QC051F