BDBM50007771 CHEMBL3233781
SMILES: CN(C)CCCN(C)C\C=C\C(=O)Nc1cc2c(Nc3ccc(F)c(Cl)c3)ncnc2s1
InChI Key: InChIKey=QYLCQESZNMYESM-GQCTYLIASA-N
Data: 1 IC50
Activity Spreadsheet -- Enzyme Inhibition Constant Data from BindingDB
Found 1 hit for monomerid = 50007771
Trg + Lig
Ki
nM
ΔG°
kcal/mole
IC50
nM
Kd
nM
EC50/IC50
nM
koff
s-1
kon
M-1s-1
pHTemp
°C
Epidermal growth factor receptor
(Homo sapiens (Human))
BDBM50007771
(CHEMBL3233781)
Show SMILES CN(C)CCCN(C)C\C=C\C(=O)Nc1cc2c(Nc3ccc(F)c(Cl)c3)ncnc2s1
Show InChI InChI=1S/C22H26ClFN6OS/c1-29(2)9-5-11-30(3)10-4-6-19(31)28-20-13-16-21(25-14-26-22(16)32-20)27-15-7-8-18(24)17(23)12-15/h4,6-8,12-14H,5,9-11H2,1-3H3,(H,28,31)(H,25,26,27)/b6-4+
n/an/a 93n/an/an/an/an/an/a
Chinese Academy of Sciences
Curated by ChEMBL
Assay Description
Inhibition of wild type EGFR domain (unknown origin) expressed in baculovirus expression system using Poly(Glu:Tyr)4:1 substrate after 60 mins by ELI...
Bioorg Med Chem 22: 2366-78 (2014)
Article DOI: 10.1016/j.bmc.2014.01.035
BindingDB Entry DOI: 10.7270/Q2QC051F