BDBM50007777 CHEMBL3233788
SMILES: CSC1CCN(C\C=C\C(=O)Nc2cc3c(Nc4ccc(F)c(Cl)c4)ncnc3s2)CC1
InChI Key: InChIKey=CKCQIMWQWQDOML-NSCUHMNNSA-N
Data: 1 IC50
Activity Spreadsheet -- Enzyme Inhibition Constant Data from BindingDB
Found 1 hit for monomerid = 50007777
Trg + Lig
Ki
nM
ΔG°
kcal/mole
IC50
nM
Kd
nM
EC50/IC50
nM
koff
s-1
kon
M-1s-1
pHTemp
°C
Epidermal growth factor receptor
(Homo sapiens (Human))
BDBM50007777
(CHEMBL3233788)
Show SMILES CSC1CCN(C\C=C\C(=O)Nc2cc3c(Nc4ccc(F)c(Cl)c4)ncnc3s2)CC1
Show InChI InChI=1S/C22H23ClFN5OS2/c1-31-15-6-9-29(10-7-15)8-2-3-19(30)28-20-12-16-21(25-13-26-22(16)32-20)27-14-4-5-18(24)17(23)11-14/h2-5,11-13,15H,6-10H2,1H3,(H,28,30)(H,25,26,27)/b3-2+
n/an/a 18n/an/an/an/an/an/a
Chinese Academy of Sciences
Curated by ChEMBL
Assay Description
Inhibition of wild type EGFR domain (unknown origin) expressed in baculovirus expression system using Poly(Glu:Tyr)4:1 substrate after 60 mins by ELI...
Bioorg Med Chem 22: 2366-78 (2014)
Article DOI: 10.1016/j.bmc.2014.01.035
BindingDB Entry DOI: 10.7270/Q2QC051F