null
SMILES: CC[C@@H]1[C@@H](Cc2cncn2C)CSC1=S
InChI Key: InChIKey=YCCVZRIFCRPGSK-WCBMZHEXSA-N
Activity Spreadsheet -- Enzyme Inhibition Constant Data from BindingDB
Found 2 hits for monomerid = 50008081
Trg + Lig
Ki
nM
ΔG°
kcal/mole
IC50
nM
Kd
nM
EC50/IC50
nM
koff
s-1
kon
M-1s-1
pHTemp
°C
Muscarinic acetylcholine receptor M1/M2/M3/M4/M5
(RAT)
BDBM50008081
(3-Ethyl-4-(3-methyl-3H-imidazol-4-ylmethyl)-dihydr...)
Show SMILES CC[C@@H]1[C@@H](Cc2cncn2C)CSC1=S
Show InChI InChI=1S/C11H16N2S2/c1-3-10-8(6-15-11(10)14)4-9-5-12-7-13(9)2/h5,7-8,10H,3-4,6H2,1-2H3/t8-,10+/m0/s1
NCI pathway
Reactome pathway
n/an/a 45n/an/an/an/an/an/a
Sandoz Pharma Ltd.
Curated by ChEMBL
Assay Description
Ability to displace [3H]cis--2-methyl-5-((dimethylamino)methyl)-1,3-di oxolane from muscarinic acetylcholine receptor in rat cortical tissue.
J Med Chem 35: 15-27 (1992)
BindingDB Entry DOI: 10.7270/Q29022RV
Muscarinic acetylcholine receptor M1
(RAT)
BDBM50008081
(3-Ethyl-4-(3-methyl-3H-imidazol-4-ylmethyl)-dihydr...)
Show SMILES CC[C@@H]1[C@@H](Cc2cncn2C)CSC1=S
Show InChI InChI=1S/C11H16N2S2/c1-3-10-8(6-15-11(10)14)4-9-5-12-7-13(9)2/h5,7-8,10H,3-4,6H2,1-2H3/t8-,10+/m0/s1
Reactome pathway
n/an/a 51n/an/an/an/an/an/a
Sandoz Pharma Ltd.
Curated by ChEMBL
Assay Description
Ability to displace [3H]-pirenzepine (pir) from muscarinic acetylcholine receptor M1 in rat cortical tissue.
J Med Chem 35: 15-27 (1992)
BindingDB Entry DOI: 10.7270/Q29022RV