BDBM50008236 CHEMBL3235109
SMILES: CCNC(=O)c1nnn(c1-c1ccc(CNCCN(CC)CC)cc1)-c1cc(C(C)C)c(O)cc1O
InChI Key: InChIKey=GRWUWTJRPDVUNR-UHFFFAOYSA-N
Data: 1 IC50
Activity Spreadsheet -- Enzyme Inhibition Constant Data from BindingDB
Found 1 hit for monomerid = 50008236
Trg + Lig
Ki
nM
ΔG°
kcal/mole
IC50
nM
Kd
nM
EC50/IC50
nM
koff
s-1
kon
M-1s-1
pHTemp
°C
Heat shock protein HSP 90-alpha
(Homo sapiens (Human))
BDBM50008236
(CHEMBL3235109)
Show SMILES CCNC(=O)c1nnn(c1-c1ccc(CNCCN(CC)CC)cc1)-c1cc(C(C)C)c(O)cc1O
Show InChI InChI=1S/C27H38N6O3/c1-6-29-27(36)25-26(20-11-9-19(10-12-20)17-28-13-14-32(7-2)8-3)33(31-30-25)22-15-21(18(4)5)23(34)16-24(22)35/h9-12,15-16,18,28,34-35H,6-8,13-14,17H2,1-5H3,(H,29,36)
NCI pathway
Reactome pathway
n/an/a 15n/an/an/an/an/an/a
Universit£ degli Studi di Siena
Curated by ChEMBL
Assay Description
Displacement of GM-FITC from full-length recombinant human Hsp90-alpha after 4 hrs by fluorescence polarization assay
J Med Chem 57: 2258-74 (2014)
Article DOI: 10.1021/jm401536b
BindingDB Entry DOI: 10.7270/Q2JQ12HR