BDBM50008471 CHEMBL143234::[3-(5,7-Difluoro-benzooxazol-2-ylmethyl)-4-oxo-3,4-dihydro-phthalazin-1-yl]-acetic acid
SMILES: OC(=O)Cc1nn(Cc2nc3cc(F)cc(F)c3o2)c(=O)c2ccccc12
InChI Key: InChIKey=GDULRSFIHLMHJW-UHFFFAOYSA-N
Data: 2 IC50
Activity Spreadsheet -- Enzyme Inhibition Constant Data from BindingDB
Found 2 hits for monomerid = 50008471
Trg + Lig
Ki
nM
ΔG°
kcal/mole
IC50
nM
Kd
nM
EC50/IC50
nM
koff
s-1
kon
M-1s-1
pHTemp
°C
Aldose reductase
(Homo sapiens (Human))
BDBM50008471
(CHEMBL143234 | [3-(5,7-Difluoro-benzooxazol-2-ylme...)
Show SMILES OC(=O)Cc1nn(Cc2nc3cc(F)cc(F)c3o2)c(=O)c2ccccc12
Show InChI InChI=1S/C18H11F2N3O4/c19-9-5-12(20)17-14(6-9)21-15(27-17)8-23-18(26)11-4-2-1-3-10(11)13(22-23)7-16(24)25/h1-6H,7-8H2,(H,24,25)
n/an/a 3.20n/an/an/an/an/an/a
Y. B. Chavan College of Pharmacy
Curated by ChEMBL
Assay Description
Inhibition of human placenta Aldose reductase
Bioorg Med Chem 27: 3979-3997 (2019)
Article DOI: 10.1016/j.bmc.2019.07.050
Aldose reductase (AR)
(Homo sapiens (Human))
BDBM50008471
(CHEMBL143234 | [3-(5,7-Difluoro-benzooxazol-2-ylme...)
Show SMILES OC(=O)Cc1nn(Cc2nc3cc(F)cc(F)c3o2)c(=O)c2ccccc12
Show InChI InChI=1S/C18H11F2N3O4/c19-9-5-12(20)17-14(6-9)21-15(27-17)8-23-18(26)11-4-2-1-3-10(11)13(22-23)7-16(24)25/h1-6H,7-8H2,(H,24,25)
n/an/a 3.20n/an/an/an/an/an/a
Pfizer Inc
Curated by ChEMBL
Assay Description
In vitro inhibitory activity against aldose reductase isolated from human placenta
J Med Chem 35: 457-65 (1992)
BindingDB Entry DOI: 10.7270/Q28051K1