BDBM50008501 CHEMBL3235561
SMILES: COc1ccc(CC(=O)Nc2nc3ccc(OC)cc3s2)cc1
InChI Key: InChIKey=JZTYQGUKAKEWPC-UHFFFAOYSA-N
Data: 1 IC50
Activity Spreadsheet -- Enzyme Inhibition Constant Data from BindingDB
Found 1 hit for monomerid = 50008501
Trg + Lig
Ki
nM
ΔG°
kcal/mole
IC50
nM
Kd
nM
EC50/IC50
nM
koff
s-1
kon
M-1s-1
pHTemp
°C
Casein kinase I isoform delta
(Homo sapiens (Human))
BDBM50008501
(CHEMBL3235561)
Show SMILES COc1ccc(CC(=O)Nc2nc3ccc(OC)cc3s2)cc1
Show InChI InChI=1S/C17H16N2O3S/c1-21-12-5-3-11(4-6-12)9-16(20)19-17-18-14-8-7-13(22-2)10-15(14)23-17/h3-8,10H,9H2,1-2H3,(H,18,19,20)
n/an/a 570n/an/an/an/an/an/a
CSIC
Curated by ChEMBL
Assay Description
Inhibition of human recombinant CK-1delta using casein as substrate after 60 mins by Kinase-Glo assay
J Med Chem 57: 2755-72 (2014)
Article DOI: 10.1021/jm500065f
BindingDB Entry DOI: 10.7270/Q21N82NV