BDBM50008574 2-[3-(1-Methyl-piperidin-4-yl)-propylidene]-indan-1-one::CHEMBL155945
SMILES: CN1CCC(CCC=C2Cc3ccccc3C2=O)CC1
InChI Key: InChIKey=OMPBSOCJDMTCKX-UHFFFAOYSA-N
Data: 1 IC50
Activity Spreadsheet -- Enzyme Inhibition Constant Data from BindingDB
Found 1 hit for monomerid = 50008574
Trg + Lig
Ki
nM
ΔG°
kcal/mole
IC50
nM
Kd
nM
EC50/IC50
nM
koff
s-1
kon
M-1s-1
pHTemp
°C
Acetylcholinesterase
(Homo sapiens (Human))
BDBM50008574
(2-[3-(1-Methyl-piperidin-4-yl)-propylidene]-indan-...)
Show SMILES CN1CCC(CCC=C2Cc3ccccc3C2=O)CC1 |w:7.6|
Show InChI InChI=1S/C18H23NO/c1-19-11-9-14(10-12-19)5-4-7-16-13-15-6-2-3-8-17(15)18(16)20/h2-3,6-8,14H,4-5,9-13H2,1H3
NCI pathway
Reactome pathway
n/an/a 0.820n/an/an/an/an/an/a
University of Illinois
Curated by ChEMBL
Assay Description
Inhibition of acetylcholinesterase activity
J Med Chem 35: 590-601 (1992)
BindingDB Entry DOI: 10.7270/Q2VQ31NP