BDBM50009266 CHEMBL3233195
SMILES: Cc1cc(O)cc(C)c1C[C@H](N)C(=O)N1CCC[C@H]1C(=O)N[C@@H](Cc1ccccc1)C(=O)N[C@@H](Cc1c(C)cc(O)cc1C)C(N)=O
InChI Key: InChIKey=FSDAHJDHUQDCNF-YDPTYEFTSA-N
Data: 2 KI  2 IC50
Activity Spreadsheet -- Enzyme Inhibition Constant Data from BindingDB
Found 4 hits for monomerid = 50009266
Trg + Lig
Ki
nM
ΔG°
kcal/mole
IC50
nM
Kd
nM
EC50/IC50
nM
koff
s-1
kon
M-1s-1
pHTemp
°C
Mu-type opioid receptor
(Rattus norvegicus (rat))
BDBM50009266
(CHEMBL3233195)
Show SMILES Cc1cc(O)cc(C)c1C[C@H](N)C(=O)N1CCC[C@H]1C(=O)N[C@@H](Cc1ccccc1)C(=O)N[C@@H](Cc1c(C)cc(O)cc1C)C(N)=O |r|
Show InChI InChI=1S/C36H45N5O6/c1-20-13-25(42)14-21(2)27(20)18-29(37)36(47)41-12-8-11-32(41)35(46)40-31(17-24-9-6-5-7-10-24)34(45)39-30(33(38)44)19-28-22(3)15-26(43)16-23(28)4/h5-7,9-10,13-16,29-32,42-43H,8,11-12,17-19,37H2,1-4H3,(H2,38,44)(H,39,45)(H,40,46)/t29-,30-,31-,32-/m0/s1
Reactome pathway
0.280n/an/an/an/an/an/an/an/a
Nanjing Medical University
Curated by ChEMBL
Assay Description
Displacement of [3H]DAMGO from mu opioid receptor in Sprague-Dawley rat brain P2 synaptosomal membranes
Bioorg Med Chem 22: 2208-19 (2014)
Article DOI: 10.1016/j.bmc.2014.02.015
BindingDB Entry DOI: 10.7270/Q29Z96DB
Opioid receptors; mu & delta
(Rattus norvegicus (rat))
BDBM50009266
(CHEMBL3233195)
Show SMILES Cc1cc(O)cc(C)c1C[C@H](N)C(=O)N1CCC[C@H]1C(=O)N[C@@H](Cc1ccccc1)C(=O)N[C@@H](Cc1c(C)cc(O)cc1C)C(N)=O |r|
Show InChI InChI=1S/C36H45N5O6/c1-20-13-25(42)14-21(2)27(20)18-29(37)36(47)41-12-8-11-32(41)35(46)40-31(17-24-9-6-5-7-10-24)34(45)39-30(33(38)44)19-28-22(3)15-26(43)16-23(28)4/h5-7,9-10,13-16,29-32,42-43H,8,11-12,17-19,37H2,1-4H3,(H2,38,44)(H,39,45)(H,40,46)/t29-,30-,31-,32-/m0/s1
Reactome pathway
87n/an/an/an/an/an/an/an/a
Nanjing Medical University
Curated by ChEMBL
Assay Description
Displacement of [3H]deltorphin-2 from delta opioid receptor in Sprague-Dawley rat brain P2 synaptosomal membranes
Bioorg Med Chem 22: 2208-19 (2014)
Article DOI: 10.1016/j.bmc.2014.02.015
BindingDB Entry DOI: 10.7270/Q29Z96DB
Mu-type opioid receptor
(GUINEA PIG)
BDBM50009266
(CHEMBL3233195)
Show SMILES Cc1cc(O)cc(C)c1C[C@H](N)C(=O)N1CCC[C@H]1C(=O)N[C@@H](Cc1ccccc1)C(=O)N[C@@H](Cc1c(C)cc(O)cc1C)C(N)=O |r|
Show InChI InChI=1S/C36H45N5O6/c1-20-13-25(42)14-21(2)27(20)18-29(37)36(47)41-12-8-11-32(41)35(46)40-31(17-24-9-6-5-7-10-24)34(45)39-30(33(38)44)19-28-22(3)15-26(43)16-23(28)4/h5-7,9-10,13-16,29-32,42-43H,8,11-12,17-19,37H2,1-4H3,(H2,38,44)(H,39,45)(H,40,46)/t29-,30-,31-,32-/m0/s1
n/an/a 45n/an/an/an/an/an/a
Nanjing Medical University
Curated by ChEMBL
Assay Description
Agonist activity at mu opioid receptor in guinea pig ileum assessed as inhibition of electrically-stimulated muscle contraction
Bioorg Med Chem 22: 2208-19 (2014)
Article DOI: 10.1016/j.bmc.2014.02.015
BindingDB Entry DOI: 10.7270/Q29Z96DB
Delta-type opioid receptor
(MOUSE)
BDBM50009266
(CHEMBL3233195)
Show SMILES Cc1cc(O)cc(C)c1C[C@H](N)C(=O)N1CCC[C@H]1C(=O)N[C@@H](Cc1ccccc1)C(=O)N[C@@H](Cc1c(C)cc(O)cc1C)C(N)=O |r|
Show InChI InChI=1S/C36H45N5O6/c1-20-13-25(42)14-21(2)27(20)18-29(37)36(47)41-12-8-11-32(41)35(46)40-31(17-24-9-6-5-7-10-24)34(45)39-30(33(38)44)19-28-22(3)15-26(43)16-23(28)4/h5-7,9-10,13-16,29-32,42-43H,8,11-12,17-19,37H2,1-4H3,(H2,38,44)(H,39,45)(H,40,46)/t29-,30-,31-,32-/m0/s1
Reactome pathway
n/an/a>1.00E+4n/an/an/an/an/an/a
Nanjing Medical University
Curated by ChEMBL
Assay Description
Agonist activity at delta opioid receptor in mouse vas deferens assessed as inhibition of electrically-stimulated muscle contraction
Bioorg Med Chem 22: 2208-19 (2014)
Article DOI: 10.1016/j.bmc.2014.02.015
BindingDB Entry DOI: 10.7270/Q29Z96DB