BDBM50009434 10,13-Dimethyl-2,3,6,7,8,9,10,11,12,13,14,15,16,17-tetradecahydro-1H-cyclopenta[a]phenanthren-17-ol::CHEMBL439950
SMILES: CC12CCC3C(CCC4=CCCCC34C)C1CCC2O
InChI Key: InChIKey=PTPHNYFLJRHMHK-UHFFFAOYSA-N
Data: 1 KI  1 IC50
Activity Spreadsheet -- Enzyme Inhibition Constant Data from BindingDB
Found 2 hits for monomerid = 50009434
Trg + Lig
Ki
nM
ΔG°
kcal/mole
IC50
nM
Kd
nM
EC50/IC50
nM
koff
s-1
kon
M-1s-1
pHTemp
°C
Cytochrome P450 19A1
(Homo sapiens (Human))
BDBM50009434
(10,13-Dimethyl-2,3,6,7,8,9,10,11,12,13,14,15,16,17...)
Show SMILES CC12CCC3C(CCC4=CCCCC34C)C1CCC2O |t:8|
Show InChI InChI=1S/C19H30O/c1-18-11-4-3-5-13(18)6-7-14-15-8-9-17(20)19(15,2)12-10-16(14)18/h5,14-17,20H,3-4,6-12H2,1-2H3
Reactome pathway
830n/an/an/an/an/an/an/an/a
Tohoku College of Pharmacy
Curated by ChEMBL
Assay Description
Binding affinity for human placental microsome cytochrome P450 19A1 with 1 uM [1-beta-3H]-androstenedione
J Med Chem 34: 2496-504 (1991)
BindingDB Entry DOI: 10.7270/Q2MG7Q45
Cytochrome P450 19A1
(Homo sapiens (Human))
BDBM50009434
(10,13-Dimethyl-2,3,6,7,8,9,10,11,12,13,14,15,16,17...)
Show SMILES CC12CCC3C(CCC4=CCCCC34C)C1CCC2O |t:8|
Show InChI InChI=1S/C19H30O/c1-18-11-4-3-5-13(18)6-7-14-15-8-9-17(20)19(15,2)12-10-16(14)18/h5,14-17,20H,3-4,6-12H2,1-2H3
Reactome pathway
n/an/a 7.30E+3n/an/an/an/an/an/a
Tohoku College of Pharmacy
Curated by ChEMBL
Assay Description
Inhibition of 1 uM [1-beta-3H]-androstenedione binding to human placental microsome Cytochrome P450 19A1
J Med Chem 34: 2496-504 (1991)
BindingDB Entry DOI: 10.7270/Q2MG7Q45