BDBM50009435 10-Difluoromethyl-13-methyl-1,2,3,6,7,8,9,10,11,12,13,14,15,16-tetradecahydro-cyclopenta[a]phenanthren-17-one::CHEMBL83835
SMILES: CC12CCC3C(CCC4=CCCCC34C(F)F)C1CCC2=O
InChI Key: InChIKey=KMFWEHJTLFYKGK-UHFFFAOYSA-N
Data: 1 KI  1 IC50
Activity Spreadsheet -- Enzyme Inhibition Constant Data from BindingDB
Found 2 hits for monomerid = 50009435
Trg + Lig
Ki
nM
ΔG°
kcal/mole
IC50
nM
Kd
nM
EC50/IC50
nM
koff
s-1
kon
M-1s-1
pHTemp
°C
Cytochrome P450 19A1
(Homo sapiens (Human))
BDBM50009435
(10-Difluoromethyl-13-methyl-1,2,3,6,7,8,9,10,11,12...)
Show SMILES CC12CCC3C(CCC4=CCCCC34C(F)F)C1CCC2=O |t:8|
Show InChI InChI=1S/C19H26F2O/c1-18-11-9-15-13(14(18)7-8-16(18)22)6-5-12-4-2-3-10-19(12,15)17(20)21/h4,13-15,17H,2-3,5-11H2,1H3
Reactome pathway
443n/an/an/an/an/an/an/an/a
Tohoku College of Pharmacy
Curated by ChEMBL
Assay Description
Binding affinity for human placental microsome cytochrome P450 19A1 with 1 uM [1-beta-3H]-androstenedione
J Med Chem 34: 2496-504 (1991)
BindingDB Entry DOI: 10.7270/Q2MG7Q45
Cytochrome P450 19A1
(Homo sapiens (Human))
BDBM50009435
(10-Difluoromethyl-13-methyl-1,2,3,6,7,8,9,10,11,12...)
Show SMILES CC12CCC3C(CCC4=CCCCC34C(F)F)C1CCC2=O |t:8|
Show InChI InChI=1S/C19H26F2O/c1-18-11-9-15-13(14(18)7-8-16(18)22)6-5-12-4-2-3-10-19(12,15)17(20)21/h4,13-15,17H,2-3,5-11H2,1H3
Reactome pathway
n/an/a 1.20E+3n/an/an/an/an/an/a
Tohoku College of Pharmacy
Curated by ChEMBL
Assay Description
Inhibition of 1 uM [1-beta-3H]-androstenedione binding to human placental microsome Cytochrome P450 19A1
J Med Chem 34: 2496-504 (1991)
BindingDB Entry DOI: 10.7270/Q2MG7Q45