BDBM50009500 CHEMBL3234182
SMILES: COc1ccc(cc1)S(=O)(=O)N[C@@H](C)C(=O)N[C@@H](CC(C)C)C(=O)N[C@@H](CCCC[N+](C)(C)C)C(=O)N[C@@H](CO)C(N)=O
InChI Key: InChIKey=YIGDRDRANWHBPM-HCUBDLJJSA-O
Data: 1 IC50
Activity Spreadsheet -- Enzyme Inhibition Constant Data from BindingDB
Found 1 hit for monomerid = 50009500
Trg + Lig
Ki
nM
ΔG°
kcal/mole
IC50
nM
Kd
nM
EC50/IC50
nM
koff
s-1
kon
M-1s-1
pHTemp
°C
Chromobox protein homolog 7 (CBX7)
(Homo sapiens (Human))
BDBM50009500
(CHEMBL3234182)
Show SMILES COc1ccc(cc1)S(=O)(=O)N[C@@H](C)C(=O)N[C@@H](CC(C)C)C(=O)N[C@@H](CCCC[N+](C)(C)C)C(=O)N[C@@H](CO)C(N)=O |r|
Show InChI InChI=1S/C28H48N6O8S/c1-18(2)16-23(31-26(37)19(3)33-43(40,41)21-13-11-20(42-7)12-14-21)28(39)30-22(10-8-9-15-34(4,5)6)27(38)32-24(17-35)25(29)36/h11-14,18-19,22-24,33,35H,8-10,15-17H2,1-7H3,(H4-,29,30,31,32,36,37,38,39)/p+1/t19-,22-,23-,24-/m0/s1
n/an/a>2.50E+5n/an/an/an/an/an/a
University of Victoria
Curated by ChEMBL
Assay Description
Displacement of FITC-labeled H3K27me3 from CBX7 (unknown origin) after 15 mins by fluorescence polarization assay
J Med Chem 57: 2874-83 (2014)
Article DOI: 10.1021/jm401487x
BindingDB Entry DOI: 10.7270/Q2571DJ3