BDBM50009535 (CGS 22,989) 2-[6-Amino-2-(2-cyclohex-1-enyl-ethylamino)-purin-9-yl]-5-hydroxymethyl-tetrahydro-furan-3,4-diol::2-[6-Amino-2-(2-cyclohex-1-enyl-ethylamino)-purin-9-yl]-5-hydroxymethyl-tetrahydro-furan-3,4-diol::CHEMBL314313
SMILES: Nc1nc(NCCC2=CCCCC2)nc2n(cnc12)C1O[C@H](CO)[C@@H](O)[C@H]1O
InChI Key: InChIKey=SLUGAKUMOFIJEH-IKYDMHQPSA-N
Data: 2 IC50  2 EC50
Activity Spreadsheet -- Enzyme Inhibition Constant Data from BindingDB
Found 4 hits for monomerid = 50009535
Trg + Lig
Ki
nM
ΔG°
kcal/mole
IC50
nM
Kd
nM
EC50/IC50
nM
koff
s-1
kon
M-1s-1
pHTemp
°C
Adenosine receptor A1
(Rattus norvegicus (rat))
BDBM50009535
((CGS 22,989) 2-[6-Amino-2-(2-cyclohex-1-enyl-ethyl...)
Show SMILES Nc1nc(NCCC2=CCCCC2)nc2n(cnc12)C1O[C@H](CO)[C@@H](O)[C@H]1O |t:7|
Show InChI InChI=1S/C18H26N6O4/c19-15-12-16(23-18(22-15)20-7-6-10-4-2-1-3-5-10)24(9-21-12)17-14(27)13(26)11(8-25)28-17/h4,9,11,13-14,17,25-27H,1-3,5-8H2,(H3,19,20,22,23)/t11-,13-,14-,17?/m1/s1
Reactome pathway
n/an/a 2.69E+3n/an/an/an/an/an/a
CIBA-GEIGY Corporation
Curated by ChEMBL
Assay Description
Concentration required for 50% inhibition of [3H]-CHA binding on rat brain adenosine A1 receptor
J Med Chem 34: 2570-9 (1991)
BindingDB Entry DOI: 10.7270/Q2BZ66NN
Adenosine A2 receptor
(Rattus norvegicus-Rattus norvegicus (rat))
BDBM50009535
((CGS 22,989) 2-[6-Amino-2-(2-cyclohex-1-enyl-ethyl...)
Show SMILES Nc1nc(NCCC2=CCCCC2)nc2n(cnc12)C1O[C@H](CO)[C@@H](O)[C@H]1O |t:7|
Show InChI InChI=1S/C18H26N6O4/c19-15-12-16(23-18(22-15)20-7-6-10-4-2-1-3-5-10)24(9-21-12)17-14(27)13(26)11(8-25)28-17/h4,9,11,13-14,17,25-27H,1-3,5-8H2,(H3,19,20,22,23)/t11-,13-,14-,17?/m1/s1
n/an/a 13n/an/an/an/an/an/a
CIBA-GEIGY Corporation
Curated by ChEMBL
Assay Description
Concentration required for 50% inhibition of [3H]NECA binding on rat brain adenosine A2 receptor
J Med Chem 34: 2570-9 (1991)
BindingDB Entry DOI: 10.7270/Q2BZ66NN
Adenosine A2 receptor
(Homo sapiens (Human))
BDBM50009535
((CGS 22,989) 2-[6-Amino-2-(2-cyclohex-1-enyl-ethyl...)
Show SMILES Nc1nc(NCCC2=CCCCC2)nc2n(cnc12)C1O[C@H](CO)[C@@H](O)[C@H]1O |t:7|
Show InChI InChI=1S/C18H26N6O4/c19-15-12-16(23-18(22-15)20-7-6-10-4-2-1-3-5-10)24(9-21-12)17-14(27)13(26)11(8-25)28-17/h4,9,11,13-14,17,25-27H,1-3,5-8H2,(H3,19,20,22,23)/t11-,13-,14-,17?/m1/s1
n/an/an/an/a 2.20n/an/an/an/a
University of South Florida
Curated by ChEMBL
Assay Description
In vitro effect on coronary vasodilation in guinea pig heart.
J Med Chem 35: 4557-61 (1993)
BindingDB Entry DOI: 10.7270/Q21Z43BT
Adenosine A1 receptor
(GUINEA PIG)
BDBM50009535
((CGS 22,989) 2-[6-Amino-2-(2-cyclohex-1-enyl-ethyl...)
Show SMILES Nc1nc(NCCC2=CCCCC2)nc2n(cnc12)C1O[C@H](CO)[C@@H](O)[C@H]1O |t:7|
Show InChI InChI=1S/C18H26N6O4/c19-15-12-16(23-18(22-15)20-7-6-10-4-2-1-3-5-10)24(9-21-12)17-14(27)13(26)11(8-25)28-17/h4,9,11,13-14,17,25-27H,1-3,5-8H2,(H3,19,20,22,23)/t11-,13-,14-,17?/m1/s1
n/an/an/an/a 2.29E+4n/an/an/an/a
University of South Florida
Curated by ChEMBL
Assay Description
In vitro prolonging of the stimulus-QRS interval in guinea pig heart.
J Med Chem 35: 4557-61 (1993)
BindingDB Entry DOI: 10.7270/Q21Z43BT