BDBM50009932 4-Ethylsulfanyl-1-phenyl-pyrazolidin-3-one::CHEMBL288937
SMILES: CCSC1CN(NC1=O)c1ccccc1
InChI Key: InChIKey=BTZDVGBLKNIPKM-UHFFFAOYSA-N
Data: 1 IC50
Activity Spreadsheet -- Enzyme Inhibition Constant Data from BindingDB
Found 1 hit for monomerid = 50009932
Trg + Lig
Ki
nM
ΔG°
kcal/mole
IC50
nM
Kd
nM
EC50/IC50
nM
koff
s-1
kon
M-1s-1
pHTemp
°C
Arachidonate 5-lipoxygenase
(Rattus norvegicus)
BDBM50009932
(4-Ethylsulfanyl-1-phenyl-pyrazolidin-3-one | CHEMB...)
Show SMILES CCSC1CN(NC1=O)c1ccccc1
Show InChI InChI=1S/C11H14N2OS/c1-2-15-10-8-13(12-11(10)14)9-6-4-3-5-7-9/h3-7,10H,2,8H2,1H3,(H,12,14)
n/an/a 60n/an/an/an/an/an/a
Sterling Research Group
Curated by ChEMBL
Assay Description
In vitro inhibition of rat 5-Lipoxygenase
J Med Chem 34: 1560-70 (1991)
BindingDB Entry DOI: 10.7270/Q2RV0MPG