BDBM50009940 4-Methylsulfanyl-1-phenyl-pyrazolidin-3-one::CHEMBL40036
SMILES: CSC1CN(NC1=O)c1ccccc1
InChI Key: InChIKey=FWCDLXJKEMZLGL-UHFFFAOYSA-N
Data: 1 IC50
Activity Spreadsheet -- Enzyme Inhibition Constant Data from BindingDB
Found 1 hit for monomerid = 50009940
Trg + Lig
Ki
nM
ΔG°
kcal/mole
IC50
nM
Kd
nM
EC50/IC50
nM
koff
s-1
kon
M-1s-1
pHTemp
°C
Arachidonate 5-lipoxygenase
(Rattus norvegicus)
BDBM50009940
(4-Methylsulfanyl-1-phenyl-pyrazolidin-3-one | CHEM...)
Show SMILES CSC1CN(NC1=O)c1ccccc1
Show InChI InChI=1S/C10H12N2OS/c1-14-9-7-12(11-10(9)13)8-5-3-2-4-6-8/h2-6,9H,7H2,1H3,(H,11,13)
n/an/a 320n/an/an/an/an/an/a
Sterling Research Group
Curated by ChEMBL
Assay Description
In vitro inhibition of rat 5-Lipoxygenase
J Med Chem 34: 1560-70 (1991)
BindingDB Entry DOI: 10.7270/Q2RV0MPG