null
SMILES: O=S1(=O)N(CCCCN2CCC(=CC2)c2ccccc2)c2cccc3cccc1c23
InChI Key: InChIKey=OKJRBFNMYSRTKZ-UHFFFAOYSA-N
Activity Spreadsheet -- Enzyme Inhibition Constant Data from BindingDB
Found 3 hits for monomerid = 50010052
Trg + Lig
Ki
nM
ΔG°
kcal/mole
IC50
nM
Kd
nM
EC50/IC50
nM
koff
s-1
kon
M-1s-1
pHTemp
°C
Alpha-1A/Alpha-1B/Alpha-1D adrenergic receptor
(Rattus norvegicus (rat)-Rattus norvegicus (Rat))
BDBM50010052
(2-[4-(4-Phenyl-3,6-dihydro-2H-pyridin-1-yl)-butyl]...)
Show SMILES O=S1(=O)N(CCCCN2CCC(=CC2)c2ccccc2)c2cccc3cccc1c23 |c:11|
Show InChI InChI=1S/C25H26N2O2S/c28-30(29)24-13-7-11-22-10-6-12-23(25(22)24)27(30)17-5-4-16-26-18-14-21(15-19-26)20-8-2-1-3-9-20/h1-3,6-14H,4-5,15-19H2
Reactome pathway
n/an/a 7.80n/an/an/an/an/an/a
Centre de Recherches de Vitry Alfortville Rh£ne-Poulenc Rorer
Curated by ChEMBL
Assay Description
The concentration required to inhibit [3H]prazosin binding to Alpha-1 adrenergic receptor in rat brain membranes was measured (in vitro)
J Med Chem 34: 2477-83 (1991)
BindingDB Entry DOI: 10.7270/Q2R78FT1
Serotonin 2 (5-HT2) receptor
(RAT-Rattus norvegicus (Rat)-Rattus norvegicus (rat...)
BDBM50010052
(2-[4-(4-Phenyl-3,6-dihydro-2H-pyridin-1-yl)-butyl]...)
Show SMILES O=S1(=O)N(CCCCN2CCC(=CC2)c2ccccc2)c2cccc3cccc1c23 |c:11|
Show InChI InChI=1S/C25H26N2O2S/c28-30(29)24-13-7-11-22-10-6-12-23(25(22)24)27(30)17-5-4-16-26-18-14-21(15-19-26)20-8-2-1-3-9-20/h1-3,6-14H,4-5,15-19H2
n/an/a 2.10n/an/an/an/an/an/a
Centre de Recherches de Vitry Alfortville Rh£ne-Poulenc Rorer
Curated by ChEMBL
Assay Description
The concentration required to inhibit [3H]ketanserin binding to 5-hydroxytryptamine 2 receptor in rat brain membranes (in vitro)
J Med Chem 34: 2477-83 (1991)
BindingDB Entry DOI: 10.7270/Q2R78FT1
D(2) dopamine receptor
(Rattus norvegicus (rat))
BDBM50010052
(2-[4-(4-Phenyl-3,6-dihydro-2H-pyridin-1-yl)-butyl]...)
Show SMILES O=S1(=O)N(CCCCN2CCC(=CC2)c2ccccc2)c2cccc3cccc1c23 |c:11|
Show InChI InChI=1S/C25H26N2O2S/c28-30(29)24-13-7-11-22-10-6-12-23(25(22)24)27(30)17-5-4-16-26-18-14-21(15-19-26)20-8-2-1-3-9-20/h1-3,6-14H,4-5,15-19H2
Reactome pathway
n/an/a 55n/an/an/an/an/an/a
Centre de Recherches de Vitry Alfortville Rh£ne-Poulenc Rorer
Curated by ChEMBL
Assay Description
The concentration required to inhibit [3H]spiperone binding to dopamine receptor D2 in rat brain membranes (in vitro)
J Med Chem 34: 2477-83 (1991)
BindingDB Entry DOI: 10.7270/Q2R78FT1