BDBM50010218 7-Cyclopropylmethyl-8-methyl-6,7,8,9-tetrahydro-2H-2,7,9a-triaza-benzo[cd]azulene-1-thione::CHEMBL66434
SMILES: CC1Cn2c3c(CN1CC1CC1)cccc3[nH]c2=S
InChI Key: InChIKey=AKFJHUREZCFDBB-UHFFFAOYSA-N
Data: 1 IC50
Activity Spreadsheet -- Enzyme Inhibition Constant Data from BindingDB
Found 1 hit for monomerid = 50010218
Trg + Lig
Ki
nM
ΔG°
kcal/mole
IC50
nM
Kd
nM
EC50/IC50
nM
koff
s-1
kon
M-1s-1
pHTemp
°C
Human immunodeficiency virus type 1 reverse transcriptase
(Human immunodeficiency virus 1)
BDBM50010218
(7-Cyclopropylmethyl-8-methyl-6,7,8,9-tetrahydro-2H...)
Show SMILES CC1Cn2c3c(CN1CC1CC1)cccc3[nH]c2=S
Show InChI InChI=1S/C15H19N3S/c1-10-7-18-14-12(9-17(10)8-11-5-6-11)3-2-4-13(14)16-15(18)19/h2-4,10-11H,5-9H2,1H3,(H,16,19)
n/an/a 60n/an/an/an/an/an/a
IBM Thomas J. Watson Research Center
Curated by ChEMBL
Assay Description
Inhibitory concentration against HIV-1 replication by interfering with virus reverse transcriptase
J Med Chem 39: 2129-40 (1996)
Article DOI: 10.1021/jm950589q
BindingDB Entry DOI: 10.7270/Q2697471