null
SMILES: OCCOCn1c(Sc2ccccc2)c(I)c(=O)[nH]c1=O
InChI Key: InChIKey=IKCLKZNOCBPNBB-UHFFFAOYSA-N
Activity Spreadsheet -- Enzyme Inhibition Constant Data from BindingDB
Found 1 hit for monomerid = 50011000
Trg + Lig
Ki
nM
ΔG°
kcal/mole
IC50
nM
Kd
nM
EC50/IC50
nM
koff
s-1
kon
M-1s-1
pHTemp
°C
Reverse transcriptase/RNaseH
(Human immunodeficiency virus 1)
BDBM50011000
(1-(2-Hydroxy-ethoxymethyl)-5-iodo-6-phenylsulfanyl...)
Show SMILES OCCOCn1c(Sc2ccccc2)c(I)c(=O)[nH]c1=O
Show InChI InChI=1S/C13H13IN2O4S/c14-10-11(18)15-13(19)16(8-20-7-6-17)12(10)21-9-4-2-1-3-5-9/h1-5,17H,6-8H2,(H,15,18,19)
n/an/an/an/a 4.30E+3n/an/an/an/a
Université d'Orléans
Curated by ChEMBL
Assay Description
Inhibitory concentration against HIV-1 reverse transcriptase
J Med Chem 40: 4257-64 (1998)
Article DOI: 10.1021/jm970110p
BindingDB Entry DOI: 10.7270/Q2WS8SC3