null
SMILES: Nc1ncnc2ncc(cc12)-c1cccc(Cl)c1
InChI Key: InChIKey=KCFFGXRHAQVVCM-UHFFFAOYSA-N
Activity Spreadsheet -- Enzyme Inhibition Constant Data from BindingDB
Found 1 hit for monomerid = 50011534
Trg + Lig
Ki
nM
ΔG°
kcal/mole
IC50
nM
Kd
nM
EC50/IC50
nM
koff
s-1
kon
M-1s-1
pHTemp
°C
Mitogen-activated protein kinase kinase kinase kinase 4
(Homo sapiens (Human))
BDBM50011534
(CHEMBL3262585)
Show SMILES Nc1ncnc2ncc(cc12)-c1cccc(Cl)c1
Show InChI InChI=1S/C13H9ClN4/c14-10-3-1-2-8(4-10)9-5-11-12(15)17-7-18-13(11)16-6-9/h1-7H,(H2,15,16,17,18)
NCI pathway
Reactome pathway
n/an/a 5.84E+3n/an/an/an/an/an/a
Genentech Inc.
Curated by ChEMBL
Assay Description
Inhibition of human MAP4K4 using 5-FAM-LGRDKYKTLRQIRQ-COOH as substrate by Z'-LYTE assay
J Med Chem 57: 3484-93 (2014)
Article DOI: 10.1021/jm500155b
BindingDB Entry DOI: 10.7270/Q2M046ZR