BDBM50011538 Ac-Phe(4-SO3H)-Met-Gly-Trp-Met-Asp-Phe-NH2::CHEMBL2370122
SMILES: CSCC[C@@H](NC(=O)[C@H](Cc1ccc(OS(O)(=O)=O)cc1)NC(C)=O)C(=O)NCC(=O)N[C@@H](Cc1c[nH]c2ccccc12)C(=O)N[C@H](CCSC)C(=O)N[C@@H](CC(O)=O)C(=O)N[C@@H](Cc1ccccc1)C(N)=O
InChI Key: InChIKey=RAGVOFDQBXZYNT-ZDEACVEBSA-N
Data: 2 IC50
Activity Spreadsheet -- Enzyme Inhibition Constant Data from BindingDB
Found 2 hits for monomerid = 50011538
Trg + Lig
Ki
nM
ΔG°
kcal/mole
IC50
nM
Kd
nM
EC50/IC50
nM
koff
s-1
kon
M-1s-1
pHTemp
°C
Cholecystokinin B receptor
(Bos taurus)
BDBM50011538
(Ac-Phe(4-SO3H)-Met-Gly-Trp-Met-Asp-Phe-NH2 | CHEMB...)
Show SMILES CSCC[C@@H](NC(=O)[C@H](Cc1ccc(OS(O)(=O)=O)cc1)NC(C)=O)C(=O)NCC(=O)N[C@@H](Cc1c[nH]c2ccccc12)C(=O)N[C@H](CCSC)C(=O)N[C@@H](CC(O)=O)C(=O)N[C@@H](Cc1ccccc1)C(N)=O
Show InChI InChI=1S/C47H59N9O14S3/c1-27(57)51-37(22-29-13-15-31(16-14-29)70-73(67,68)69)45(64)53-34(17-19-71-2)43(62)50-26-40(58)52-38(23-30-25-49-33-12-8-7-11-32(30)33)46(65)54-35(18-20-72-3)44(63)56-39(24-41(59)60)47(66)55-36(42(48)61)21-28-9-5-4-6-10-28/h4-16,25,34-39,49H,17-24,26H2,1-3H3,(H2,48,61)(H,50,62)(H,51,57)(H,52,58)(H,53,64)(H,54,65)(H,55,66)(H,56,63)(H,59,60)(H,67,68,69)/t34-,35-,36+,37+,38+,39+/m1/s1
Reactome pathway
n/an/a 4.40n/an/an/an/an/an/a
Roche Research Center
Curated by ChEMBL
Assay Description
Inhibition of [3H]-propanoyl binding to cholecystokinin type B receptor subtype was determined in bovine striatum membranes
J Med Chem 34: 1125-36 (1991)
BindingDB Entry DOI: 10.7270/Q27P8XCT
Cholecystokinin receptor
(RAT)
BDBM50011538
(Ac-Phe(4-SO3H)-Met-Gly-Trp-Met-Asp-Phe-NH2 | CHEMB...)
Show SMILES CSCC[C@@H](NC(=O)[C@H](Cc1ccc(OS(O)(=O)=O)cc1)NC(C)=O)C(=O)NCC(=O)N[C@@H](Cc1c[nH]c2ccccc12)C(=O)N[C@H](CCSC)C(=O)N[C@@H](CC(O)=O)C(=O)N[C@@H](Cc1ccccc1)C(N)=O
Show InChI InChI=1S/C47H59N9O14S3/c1-27(57)51-37(22-29-13-15-31(16-14-29)70-73(67,68)69)45(64)53-34(17-19-71-2)43(62)50-26-40(58)52-38(23-30-25-49-33-12-8-7-11-32(30)33)46(65)54-35(18-20-72-3)44(63)56-39(24-41(59)60)47(66)55-36(42(48)61)21-28-9-5-4-6-10-28/h4-16,25,34-39,49H,17-24,26H2,1-3H3,(H2,48,61)(H,50,62)(H,51,57)(H,52,58)(H,53,64)(H,54,65)(H,55,66)(H,56,63)(H,59,60)(H,67,68,69)/t34-,35-,36+,37+,38+,39+/m1/s1
Reactome pathway
n/an/a 0.600n/an/an/an/an/an/a
Roche Research Center
Curated by ChEMBL
Assay Description
Inhibition of [3H]-propanoyl binding to cholecystokinin type A receptor was determined in fresh rat pancreatic tissue membranes
J Med Chem 34: 1125-36 (1991)
BindingDB Entry DOI: 10.7270/Q27P8XCT