null
SMILES: Nc1cccc(c1)-c1ccc(N)nc1
InChI Key: InChIKey=VFIDYXVNXZIHOL-UHFFFAOYSA-N
Activity Spreadsheet -- Enzyme Inhibition Constant Data from BindingDB
Found 1 hit for monomerid = 50011549
Trg + Lig
Ki
nM
ΔG°
kcal/mole
IC50
nM
Kd
nM
EC50/IC50
nM
koff
s-1
kon
M-1s-1
pHTemp
°C
Mitogen-activated protein kinase kinase kinase kinase 4
(Homo sapiens (Human))
BDBM50011549
(CHEMBL3262568)
Show SMILES Nc1cccc(c1)-c1ccc(N)nc1
Show InChI InChI=1S/C11H11N3/c12-10-3-1-2-8(6-10)9-4-5-11(13)14-7-9/h1-7H,12H2,(H2,13,14)
NCI pathway
Reactome pathway
n/an/an/a 5.10E+5n/an/an/an/an/a
Genentech Inc.
Curated by ChEMBL
Assay Description
Binding affinity to N-terminal His-tagged C-terminal Avi-tagged MAP4K4 (unknown origin) expressed in baculovirus expression system by surface plasmon...
J Med Chem 57: 3484-93 (2014)
Article DOI: 10.1021/jm500155b
BindingDB Entry DOI: 10.7270/Q2M046ZR