null
SMILES: Cc1nnc2CN=C(c3cc(\C=C/c4ccc5CCCc5c4)sc3-n12)c1ccccc1Cl
InChI Key: InChIKey=ZZUPIOGHILLCRA-BENRWUELSA-N
Activity Spreadsheet -- Enzyme Inhibition Constant Data from BindingDB
Found 1 hit for monomerid = 50011860
Trg + Lig
Ki
nM
ΔG°
kcal/mole
IC50
nM
Kd
nM
EC50/IC50
nM
koff
s-1
kon
M-1s-1
pHTemp
°C
Platelet-activating factor receptor
(Homo sapiens (Human))
BDBM50011860
(4-(2-Chloro-phenyl)-2-(2-indan-5-yl-vinyl)-9-methy...)
Show SMILES Cc1nnc2CN=C(c3cc(\C=C/c4ccc5CCCc5c4)sc3-n12)c1ccccc1Cl |c:6|
Show InChI InChI=1S/C26H21ClN4S/c1-16-29-30-24-15-28-25(21-7-2-3-8-23(21)27)22-14-20(32-26(22)31(16)24)12-10-17-9-11-18-5-4-6-19(18)13-17/h2-3,7-14H,4-6,15H2,1H3/b12-10-
Reactome pathway
n/an/a 110n/an/an/an/an/an/a
Roche Research Center
Curated by ChEMBL
Assay Description
In vitro for platelet activating factor receptor antagonist activity in a binding assay using washed whole dog platelets.
J Med Chem 34: 1440-6 (1991)
BindingDB Entry DOI: 10.7270/Q2BG2MZ9