BDBM50012612 CHEMBL3260832
SMILES: C[C@@H]1CCN(CCN1C(=O)c1ccccc1-n1nccn1)c1nc(N)c2ccsc2n1
InChI Key: InChIKey=HZJTWMIUOYBHLN-CQSZACIVSA-N
Data: 2 KI  2 IC50
Activity Spreadsheet -- Enzyme Inhibition Constant Data from BindingDB
Found 4 hits for monomerid = 50012612
Trg + Lig
Ki
nM
ΔG°
kcal/mole
IC50
nM
Kd
nM
EC50/IC50
nM
koff
s-1
kon
M-1s-1
pHTemp
°C
Orexin receptor type 1
(Homo sapiens (Human))
BDBM50012612
(CHEMBL3260832)
Show SMILES C[C@@H]1CCN(CCN1C(=O)c1ccccc1-n1nccn1)c1nc(N)c2ccsc2n1 |r|
Show InChI InChI=1S/C21H22N8OS/c1-14-6-10-27(21-25-18(22)16-7-13-31-19(16)26-21)11-12-28(14)20(30)15-4-2-3-5-17(15)29-23-8-9-24-29/h2-5,7-9,13-14H,6,10-12H2,1H3,(H2,22,25,26)/t14-/m1/s1
Reactome pathway
0.900n/an/an/an/an/an/an/an/a
Merck Research Laboratories
Curated by ChEMBL
Assay Description
Displacement of [3H]radioligand from human orexin-1 receptor expressed in CHO cells after 3 hrs by scintillation counting analysis
Bioorg Med Chem Lett 24: 2079-85 (2014)
Article DOI: 10.1016/j.bmcl.2014.03.052
BindingDB Entry DOI: 10.7270/Q2MW2JPH
Orexin receptor type 2
(Homo sapiens (Human))
BDBM50012612
(CHEMBL3260832)
Show SMILES C[C@@H]1CCN(CCN1C(=O)c1ccccc1-n1nccn1)c1nc(N)c2ccsc2n1 |r|
Show InChI InChI=1S/C21H22N8OS/c1-14-6-10-27(21-25-18(22)16-7-13-31-19(16)26-21)11-12-28(14)20(30)15-4-2-3-5-17(15)29-23-8-9-24-29/h2-5,7-9,13-14H,6,10-12H2,1H3,(H2,22,25,26)/t14-/m1/s1
Reactome pathway
9.20n/an/an/an/an/an/an/an/a
Merck Research Laboratories
Curated by ChEMBL
Assay Description
Displacement of [3H]radioligand from human orexin-2 receptor expressed in CHO cells after 3 hrs by scintillation counting analysis
Bioorg Med Chem Lett 24: 2079-85 (2014)
Article DOI: 10.1016/j.bmcl.2014.03.052
BindingDB Entry DOI: 10.7270/Q2MW2JPH
Orexin receptor type 1
(Homo sapiens (Human))
BDBM50012612
(CHEMBL3260832)
Show SMILES C[C@@H]1CCN(CCN1C(=O)c1ccccc1-n1nccn1)c1nc(N)c2ccsc2n1 |r|
Show InChI InChI=1S/C21H22N8OS/c1-14-6-10-27(21-25-18(22)16-7-13-31-19(16)26-21)11-12-28(14)20(30)15-4-2-3-5-17(15)29-23-8-9-24-29/h2-5,7-9,13-14H,6,10-12H2,1H3,(H2,22,25,26)/t14-/m1/s1
Reactome pathway
n/an/a 15n/an/an/an/an/an/a
Merck Research Laboratories
Curated by ChEMBL
Assay Description
Antagonist activity at human orexin-1 receptor expressed in CHO cells assessed as inhibition of Ala-6, 12-induced responses by FLIPR assay
Bioorg Med Chem Lett 24: 2079-85 (2014)
Article DOI: 10.1016/j.bmcl.2014.03.052
BindingDB Entry DOI: 10.7270/Q2MW2JPH
Orexin receptor type 2
(Homo sapiens (Human))
BDBM50012612
(CHEMBL3260832)
Show SMILES C[C@@H]1CCN(CCN1C(=O)c1ccccc1-n1nccn1)c1nc(N)c2ccsc2n1 |r|
Show InChI InChI=1S/C21H22N8OS/c1-14-6-10-27(21-25-18(22)16-7-13-31-19(16)26-21)11-12-28(14)20(30)15-4-2-3-5-17(15)29-23-8-9-24-29/h2-5,7-9,13-14H,6,10-12H2,1H3,(H2,22,25,26)/t14-/m1/s1
Reactome pathway
n/an/a 35n/an/an/an/an/an/a
Merck Research Laboratories
Curated by ChEMBL
Assay Description
Antagonist activity at human orexin-2 receptor expressed in CHO cells assessed as inhibition of Ala-6, 12-induced responses by FLIPR assay
Bioorg Med Chem Lett 24: 2079-85 (2014)
Article DOI: 10.1016/j.bmcl.2014.03.052
BindingDB Entry DOI: 10.7270/Q2MW2JPH