BDBM50013124 N-(Ethylphosphoryl)-L-isoleucyl-L-Trp-NHCH3
SMILES: CCOP([O-])(=O)N[C@@H]([C@@H](C)CC)C(=O)NC(Cc1c[nH]c2ccccc12)C(=O)NC
InChI Key: InChIKey=IHAZHCJWGLQJQS-VCMPKCBFSA-M
Data: 3 KI
Activity Spreadsheet -- Enzyme Inhibition Constant Data from BindingDB
Found 3 hits for monomerid = 50013124
Trg + Lig
Ki
nM
ΔG°
kcal/mole
IC50
nM
Kd
nM
EC50/IC50
nM
koff
s-1
kon
M-1s-1
pHTemp
°C
Interstitial collagenase
(Homo sapiens (Human))
BDBM50013124
(N-(Ethylphosphoryl)-L-isoleucyl-L-Trp-NHCH3)
Show SMILES CCOP([O-])(=O)N[C@@H]([C@@H](C)CC)C(=O)NC(Cc1c[nH]c2ccccc12)C(=O)NC
Show InChI InChI=1S/C20H31N4O5P/c1-5-13(3)18(24-30(27,28)29-6-2)20(26)23-17(19(25)21-4)11-14-12-22-16-10-8-7-9-15(14)16/h7-10,12-13,17-18,22H,5-6,11H2,1-4H3,(H,21,25)(H,23,26)(H2,24,27,28)/p-1/t13-,17?,18-/m0/s1
Reactome pathway
900n/an/an/an/an/an/a7.5n/a
University of Kentucky
Curated by ChEMBL
Assay Description
Assayed against human skin fibroblast Collagenase using the spectrophotometric assay with the thiol ester substrate at pH 6.5.
J Med Chem 33: 263-73 (1990)
BindingDB Entry DOI: 10.7270/Q2J9670V
Interstitial collagenase
(Homo sapiens (Human))
BDBM50013124
(N-(Ethylphosphoryl)-L-isoleucyl-L-Trp-NHCH3)
Show SMILES CCOP([O-])(=O)N[C@@H]([C@@H](C)CC)C(=O)NC(Cc1c[nH]c2ccccc12)C(=O)NC
Show InChI InChI=1S/C20H31N4O5P/c1-5-13(3)18(24-30(27,28)29-6-2)20(26)23-17(19(25)21-4)11-14-12-22-16-10-8-7-9-15(14)16/h7-10,12-13,17-18,22H,5-6,11H2,1-4H3,(H,21,25)(H,23,26)(H2,24,27,28)/p-1/t13-,17?,18-/m0/s1
Reactome pathway
1.50E+3n/an/an/an/an/an/a7.5n/a
University of Kentucky
Curated by ChEMBL
Assay Description
Assayed against human skin fibroblast Collagenase using the spectrophotometric assay with the thiol ester substrate at pH 6.5.
J Med Chem 33: 263-73 (1990)
BindingDB Entry DOI: 10.7270/Q2J9670V
Microbial collagenase
(Clostridium perfringens)
BDBM50013124
(N-(Ethylphosphoryl)-L-isoleucyl-L-Trp-NHCH3)
Show SMILES CCOP([O-])(=O)N[C@@H]([C@@H](C)CC)C(=O)NC(Cc1c[nH]c2ccccc12)C(=O)NC
Show InChI InChI=1S/C20H31N4O5P/c1-5-13(3)18(24-30(27,28)29-6-2)20(26)23-17(19(25)21-4)11-14-12-22-16-10-8-7-9-15(14)16/h7-10,12-13,17-18,22H,5-6,11H2,1-4H3,(H,21,25)(H,23,26)(H2,24,27,28)/p-1/t13-,17?,18-/m0/s1
>5.00E+6n/an/an/an/an/an/an/an/a
University of Kentucky
Curated by ChEMBL
Assay Description
Inhibition of bacterial Collagenase
J Med Chem 33: 263-73 (1990)
BindingDB Entry DOI: 10.7270/Q2J9670V