BDBM50013219 CHEMBL2375155::Sodium salt of7-[1-Cyclohexyl-4-(4-fluoro-phenyl)-2-isopropyl-1H-pyrrol-3-yl]-3,5-dihydroxy-hept-6-enoic acid
SMILES: [Na+].CC(C)c1c(\C=C\[C@H](O)C[C@@H](O)CC([O-])=O)c(cn1C1CCCCC1)-c1ccc(F)cc1
InChI Key: InChIKey=MEBHTQYJINYGAN-XECPIYGWSA-M
Data: 2 IC50
Activity Spreadsheet -- Enzyme Inhibition Constant Data from BindingDB
Found 2 hits for monomerid = 50013219
Trg + Lig
Ki
nM
ΔG°
kcal/mole
IC50
nM
Kd
nM
EC50/IC50
nM
koff
s-1
kon
M-1s-1
pHTemp
°C
3-hydroxy-3-methylglutaryl-coenzyme A reductase (HMG-CoA)
(Homo sapiens (Human))
BDBM50013219
(CHEMBL2375155 | Sodium salt of7-[1-Cyclohexyl-4-(4...)
Show SMILES [Na+].CC(C)c1c(\C=C\[C@H](O)C[C@@H](O)CC([O-])=O)c(cn1C1CCCCC1)-c1ccc(F)cc1
Show InChI InChI=1S/C26H34FNO4.Na/c1-17(2)26-23(13-12-21(29)14-22(30)15-25(31)32)24(18-8-10-19(27)11-9-18)16-28(26)20-6-4-3-5-7-20;/h8-13,16-17,20-22,29-30H,3-7,14-15H2,1-2H3,(H,31,32);/q;+1/p-1/b13-12+;/t21-,22+;/m0./s1
n/an/a 0.106n/an/an/an/an/an/a
Hoechst AG
Curated by ChEMBL
Assay Description
Inhibition of cellular HMG-CoA reductase in cultures of hepatic cells (HEP G2, a human hepatoma cell line)
J Med Chem 33: 61-70 (1990)
BindingDB Entry DOI: 10.7270/Q22V2F4S
HMG-CoA reductase
(Rattus norvegicus (rat))
BDBM50013219
(CHEMBL2375155 | Sodium salt of7-[1-Cyclohexyl-4-(4...)
Show SMILES [Na+].CC(C)c1c(\C=C\[C@H](O)C[C@@H](O)CC([O-])=O)c(cn1C1CCCCC1)-c1ccc(F)cc1
Show InChI InChI=1S/C26H34FNO4.Na/c1-17(2)26-23(13-12-21(29)14-22(30)15-25(31)32)24(18-8-10-19(27)11-9-18)16-28(26)20-6-4-3-5-7-20;/h8-13,16-17,20-22,29-30H,3-7,14-15H2,1-2H3,(H,31,32);/q;+1/p-1/b13-12+;/t21-,22+;/m0./s1
Reactome pathway
n/an/a 69n/an/an/an/an/an/a
Hoechst AG
Curated by ChEMBL
Assay Description
In vitro inhibition of HMG-CoA reductase of rat liver
J Med Chem 33: 61-70 (1990)
BindingDB Entry DOI: 10.7270/Q22V2F4S