BDBM50013354 CHEMBL409888::Gly-Ala-Val-Val-Asn-Asp-Leu::H-Gly-Ala-Val-Val-Asn-Asp-Leu-OH
SMILES: CC(C)C[C@H](NC(=O)[C@H](CC(O)=O)NC(=O)[C@H](CC(N)=O)NC(=O)[C@@H](NC(=O)[C@@H](NC(=O)[C@H](C)NC(=O)CN)C(C)C)C(C)C)C(O)=O
InChI Key: InChIKey=OVQQULKVXPQEHN-MPQCOTKXSA-N
Data: 2 IC50
Activity Spreadsheet -- Enzyme Inhibition Constant Data from BindingDB
Found 2 hits for monomerid = 50013354
Trg + Lig
Ki
nM
ΔG°
kcal/mole
IC50
nM
Kd
nM
EC50/IC50
nM
koff
s-1
kon
M-1s-1
pHTemp
°C
Ribonucleoside-diphosphate reductase large chain
(Human herpesvirus 1 (strain 17) (HHV-1) (Human her...)
BDBM50013354
(CHEMBL409888 | Gly-Ala-Val-Val-Asn-Asp-Leu | H-Gly...)
Show SMILES CC(C)C[C@H](NC(=O)[C@H](CC(O)=O)NC(=O)[C@H](CC(N)=O)NC(=O)[C@@H](NC(=O)[C@@H](NC(=O)[C@H](C)NC(=O)CN)C(C)C)C(C)C)C(O)=O
Show InChI InChI=1S/C29H50N8O11/c1-12(2)8-18(29(47)48)35-26(44)17(10-21(40)41)33-25(43)16(9-19(31)38)34-27(45)22(13(3)4)37-28(46)23(14(5)6)36-24(42)15(7)32-20(39)11-30/h12-18,22-23H,8-11,30H2,1-7H3,(H2,31,38)(H,32,39)(H,33,43)(H,34,45)(H,35,44)(H,36,42)(H,37,46)(H,40,41)(H,47,48)/t15-,16-,17-,18-,22-,23-/m0/s1
n/an/a 2.25E+5n/an/an/an/an/an/a
Notre-Dame Hospital Research
Curated by ChEMBL
Assay Description
Inhibitory activity was determined against HSV-1 Ribonucleoside diphosphate reductase
J Med Chem 33: 723-30 (1990)
BindingDB Entry DOI: 10.7270/Q2XD128X
Ribonucleoside-diphosphate reductase large chain
(Human herpesvirus 1 (strain 17) (HHV-1) (Human her...)
BDBM50013354
(CHEMBL409888 | Gly-Ala-Val-Val-Asn-Asp-Leu | H-Gly...)
Show SMILES CC(C)C[C@H](NC(=O)[C@H](CC(O)=O)NC(=O)[C@H](CC(N)=O)NC(=O)[C@@H](NC(=O)[C@@H](NC(=O)[C@H](C)NC(=O)CN)C(C)C)C(C)C)C(O)=O
Show InChI InChI=1S/C29H50N8O11/c1-12(2)8-18(29(47)48)35-26(44)17(10-21(40)41)33-25(43)16(9-19(31)38)34-27(45)22(13(3)4)37-28(46)23(14(5)6)36-24(42)15(7)32-20(39)11-30/h12-18,22-23H,8-11,30H2,1-7H3,(H2,31,38)(H,32,39)(H,33,43)(H,34,45)(H,35,44)(H,36,42)(H,37,46)(H,40,41)(H,47,48)/t15-,16-,17-,18-,22-,23-/m0/s1
n/an/a 3.60E+4n/an/an/an/an/an/a
Notre-Dame Hospital Research
Curated by ChEMBL
Assay Description
Inhibitory activity against HSV-1 Ribonucleoside diphosphate reductase was determined
J Med Chem 33: 723-30 (1990)
BindingDB Entry DOI: 10.7270/Q2XD128X