BDBM50013508 CHEMBL3263771
SMILES: COc1ccccc1-c1cc(Nc2cccc(NS(N)(=O)=O)c2)ncn1
InChI Key: InChIKey=CLNKTAGHOZUCSU-UHFFFAOYSA-N
Data: 1 IC50
Activity Spreadsheet -- Enzyme Inhibition Constant Data from BindingDB
Found 1 hit for monomerid = 50013508
Trg + Lig
Ki
nM
ΔG°
kcal/mole
IC50
nM
Kd
nM
EC50/IC50
nM
koff
s-1
kon
M-1s-1
pHTemp
°C
Cyclin-Dependent Kinase 9 (CDK9)
(Homo sapiens (Human))
BDBM50013508
(CHEMBL3263771)
Show SMILES COc1ccccc1-c1cc(Nc2cccc(NS(N)(=O)=O)c2)ncn1
Show InChI InChI=1S/C17H17N5O3S/c1-25-16-8-3-2-7-14(16)15-10-17(20-11-19-15)21-12-5-4-6-13(9-12)22-26(18,23)24/h2-11,22H,1H3,(H2,18,23,24)(H,19,20,21)
Reactome pathway
n/an/a 170n/an/an/an/an/an/a
Vichem Chemie Ltd.
Curated by ChEMBL
Assay Description
Inhibition of CDK9/CycT1 (unknown origin)
J Med Chem 57: 3939-65 (2014)
Article DOI: 10.1021/jm401742r
BindingDB Entry DOI: 10.7270/Q28C9XRB